{"text_format":"3","workbook":"xlsx","n_sheets":13,"sheets":["Briza Net Zero","cal","NL","EN","DE","FR","NR","SP","SW","TS","RU","ExtraTaal2","ExtraTaal3"],"not_rendered":{"images":4,"macros":1,"defined_names":10,"comments":1},"read":"whole","date_system":"1900"}

{"sheet":"Briza Net Zero","index":0,"n_rows":40,"n_cols":16,"rows_kept":40,"merged":[[0,14,1,15],[1,1,1,2],[1,6,1,9],[1,10,1,11],[2,1,2,2],[2,14,2,15],[3,6,3,9],[3,10,3,12],[5,12,5,13],[6,12,6,13],[7,1,7,3],[7,6,7,9],[7,12,7,13],[8,1,8,3],[8,6,8,9],[8,12,11,13],[9,1,9,3],[9,6,9,9],[10,6,10,9],[14,1,14,15],[20,1,20,15],[26,1,26,15],[32,1,32,15]]}
[]
[null,"Подбор",{"$nulls":4},"Taal/Language/Sprache/Язык/Jazyk",0,0,0,"Русский"]
[null,"Briza Net Zero "]
[{"$nulls":6},{"$f":"IF(cal!$S$7=1,\"Uitvoering\",IF(cal!$S$7=2,\"Version\",IF(cal!$S$7=3,\"Ausführung\",IF(cal!$S$7=4,\"Version\",IF(cal!$S$7=5,\"Modell\",IF(cal!$S$7=6,\"Montaje\",IF(cal!$S$7=7,\"Version\",IF(cal!$S$7=8,\"Verze\",IF(cal!$S$7=9,\"Модель\",IF(cal!$S$7=10,\"ExtraTaal2\",IF(cal!$S$7=11,\"ExtraTaal3\",)))))))))))","v":"Модель"},{"$nulls":3},"Briza Net Zero M H42 2P",null,null,"Настенный"]
[]
[null,{"$f":"cal!B7","v":"Температура"},{"$nulls":10},{"$f":"cal!M7","v":"h_atm"},0]
[null,{"$f":"cal!B8","v":"Обогрев:"},{"$nulls":4},{"$f":"cal!G8","v":"Охлаждение:"},{"$nulls":5},0,0,{"$f":"IF(UnitsNo=1,\"m\",IF(UnitsNo=2,\"ft\"))","v":"m"}]
[null,{"$f":"cal!B9","v":"Темп.подачи"},{"$f":"cal!C9","v":0},{"$f":"cal!D9","v":0},95,{"$f":"cal!F9","v":"°C"},{"$f":"cal!G9","v":"Темп.подачи"},{"$f":"cal!H9","v":0},{"$f":"cal!I9","v":0},{"$f":"cal!J9","v":0},{"v":7.000000000000001,"d":"7"},{"$f":"cal!L9","v":"°C"},{"$f":"cal!M9","v":0}]
[null,{"$f":"cal!B10","v":"Темп.обратная"},{"$f":"cal!C10","v":0},{"$f":"cal!D10","v":0},70,{"$f":"cal!F10","v":"°C"},{"$f":"cal!G10","v":"Темп.обратная"},{"$f":"cal!H10","v":0},{"$f":"cal!I10","v":0},{"$f":"cal!J10","v":0},12,{"$f":"cal!L10","v":"°C"}]
[null,{"$f":"cal!B11","v":"Темп.воздуха"},{"$f":"cal!C11","v":0},{"$f":"cal!D11","v":0},20,{"$f":"cal!F11","v":"°C"},{"$f":"cal!G11","v":"Темп.воздуха"},{"$f":"cal!H11","v":0},{"$f":"cal!I11","v":0},{"$f":"cal!J11","v":0},20,{"$f":"cal!L11","v":"°C"}]
[{"$nulls":6},{"$f":"cal!G12","v":"Влажность"},{"$nulls":3},{"v":0.5,"d":"50%"}]
[]
[{"$nulls":3},{"$f":"cal!D14","v":{"v":1,"d":"1.0000"}},{"$f":"cal!E14","v":{"v":1,"d":"1.0000"}},{"$f":"cal!F14","v":{"v":1,"d":"1.0000"}},{"$f":"cal!G14","v":{"v":1,"d":"1.0000"}},{"$f":"cal!H14","v":{"v":1,"d":"1.0000"}},{"$f":"cal!I14","v":{"v":1,"d":"1.0000"}},{"$f":"cal!J14","v":{"v":1,"d":"1.0000"}},{"$f":"cal!K14","v":0.000334444444444444},{"$f":"cal!L14","v":0},{"$f":"cal!M14","v":1},{"$f":"cal!N14","v":{"v":1,"d":"1.0000"}}]
[null,{"$f":"cal!B15","v":"Скорость вентилятора"},{"$f":"cal!C15","v":"Управляющий сигнал [V]"},{"$f":"cal!D15","v":"Мощность отпление 95/70/20 [W]"},{"$f":"cal!E15","v":"Расход теплоносителя, отопление [l/h]"},{"$f":"cal!F15","v":"Потери давления жидкости [kPa]"},{"$f":"cal!G15","v":"Ощущ. мощность, охлаждение 7/12/20 [W]"},{"$f":"cal!H15","v":"Общая мощность , охлаждение 7/12/20 [W]"},{"$f":"cal!I15","v":"Расход теплоносителя, охлаждение [l/h]"},{"$f":"cal!J15","v":"Потери давления жидкости [kPa]"},{"$f":"cal!K15","v":"Звуковое давление ** [dB(A)]"},{"$f":"cal!L15","v":"Звуковая мощность * [dB(A)]"},{"$f":"cal!M15","v":"Потребляемая мощность [W]"},{"$f":"cal!N15","v":"Расход воздуха [m³/h]"},{"$f":"cal!O15","v":"Темп. воздуха на выходе. отопление  [°C]"},{"$f":"cal!P15","v":"Темп.воздуха на выходе. охлаждение  [°C]"}]
[null,{"$f":"cal!B16","v":"Briza Net Zero M H42 2P Высота 42 cm Ширина 14 cm Длина 75 cm (Тип 1)"}]
[null,{"$f":"cal!B17","v":{"v":0.2,"d":"20%"}},{"$f":"cal!C17","v":2},{"$f":"IF($E$8<=$E$9,cal!$Z$3,cal!D17)","v":{"v":1116.8149275288226,"d":"1117"}},{"$f":"IF($E$8<=$E$9,\"\",cal!E17)","v":38},{"$f":"IF($E$8<=$E$9,\"\",cal!F17)","v":{"v":0.049493533406665124,"d":"0.05"}},{"$f":"IF($K$8>=$K$9,cal!$Z$3,cal!G17)","v":{"v":119.20881976373083,"d":"119"}},{"$f":"IF($K$8>=$K$9,\"\",cal!H17)","v":{"v":119.20881976373083,"d":"119"}},{"$f":"IF($K$8>=$K$9,\"\",cal!I17)","v":21},{"$f":"IF($K$8>=$K$9,\"\",cal!J17)","v":{"v":0.01666107031282953,"d":"0.02"}},{"$f":"cal!K17","v":"<20"},{"$f":"cal!L17","v":26.5},{"$f":"cal!M17","v":1.6},{"$f":"cal!N17","v":64},{"$f":"IF($K$8>=$K$9,\"\",cal!O17)","v":{"v":71.8655836356416,"d":"71.9"}},{"$f":"IF($K$8>=$K$9,\"\",cal!P17)","v":{"v":14.463867862831428,"d":"14.5"}}]
[null,{"$f":"cal!B18","v":{"v":0.4,"d":"40%"}},{"$f":"cal!C18","v":4},{"$f":"IF($E$8<=$E$9,cal!$Z$4,cal!D18)","v":{"v":1280.044083187076,"d":"1280"}},{"$f":"IF($E$8<=$E$9,\"\",cal!E18)","v":44},{"$f":"IF($E$8<=$E$9,\"\",cal!F18)","v":{"v":0.06477902179486981,"d":"0.06"}},{"$f":"IF($K$8>=$K$9,cal!$Z$5,cal!G18)","v":{"v":139.14180443920728,"d":"139"}},{"$f":"IF($K$8>=$K$9,\"\",cal!H18)","v":{"v":139.14180443920728,"d":"139"}},{"$f":"IF($K$8>=$K$9,\"\",cal!I18)","v":24},{"$f":"IF($K$8>=$K$9,\"\",cal!J18)","v":{"v":0.021289553035389902,"d":"0.02"}},{"$f":"cal!K18","v":29.4},{"$f":"cal!L18","v":37.4},{"$f":"cal!M18","v":2.6},{"$f":"cal!N18","v":101},{"$f":"IF($K$8>=$K$9,\"\",cal!O18)","v":{"v":57.66878270093167,"d":"57.7"}},{"$f":"IF($K$8>=$K$9,\"\",cal!P18)","v":{"v":15.905373521991413,"d":"15.9"}}]
[null,{"$f":"cal!B19","v":{"v":0.6,"d":"60%"}},{"$f":"cal!C19","v":6},{"$f":"IF($E$8<=$E$9,\"\",cal!D19)","v":{"v":1477.7034719623746,"d":"1478"}},{"$f":"IF($E$8<=$E$9,\"\",cal!E19)","v":51},{"$f":"IF($E$8<=$E$9,\"\",cal!F19)","v":{"v":0.08494611790310158,"d":"0.08"}},{"$f":"IF($K$8>=$K$9,\"\",cal!G19)","v":{"v":163.78139160055466,"d":"164"}},{"$f":"IF($K$8>=$K$9,\"\",cal!H19)","v":{"v":163.78139160055466,"d":"164"}},{"$f":"IF($K$8>=$K$9,\"\",cal!I19)","v":28},{"$f":"IF($K$8>=$K$9,\"\",cal!J19)","v":{"v":0.02825334052634823,"d":"0.03"}},{"$f":"cal!K19","v":{"v":31.299999999999997,"d":"31.3"}},{"$f":"cal!L19","v":39.3},{"$f":"cal!M19","v":4.3},{"$f":"cal!N19","v":141},{"$f":"IF($K$8>=$K$9,\"\",cal!O19)","v":{"v":51.14915101099861,"d":"51.1"}},{"$f":"IF($K$8>=$K$9,\"\",cal!P19)","v":{"v":16.547581164587616,"d":"16.5"}}]
[null,{"$f":"cal!B20","v":{"v":0.8,"d":"80%"}},{"$f":"cal!C20","v":8},{"$f":"IF($E$8<=$E$9,\"\",cal!D20)","v":{"v":1731.189213486523,"d":"1731"}},{"$f":"IF($E$8<=$E$9,\"\",cal!E20)","v":60},{"$f":"IF($E$8<=$E$9,\"\",cal!F20)","v":{"v":0.11447713273267565,"d":"0.11"}},{"$f":"IF($K$8>=$K$9,\"\",cal!G20)","v":{"v":191.6346770511314,"d":"192"}},{"$f":"IF($K$8>=$K$9,\"\",cal!H20)","v":{"v":191.6346770511314,"d":"192"}},{"$f":"IF($K$8>=$K$9,\"\",cal!I20)","v":33},{"$f":"IF($K$8>=$K$9,\"\",cal!J20)","v":{"v":0.038200362039105804,"d":"0.04"}},{"$f":"cal!K20","v":37.3},{"$f":"cal!L20","v":45.3},{"$f":"cal!M20","v":7.2},{"$f":"cal!N20","v":178},{"$f":"IF($K$8>=$K$9,\"\",cal!O20)","v":{"v":48.90696977079389,"d":"48.9"}},{"$f":"IF($K$8>=$K$9,\"\",cal!P20)","v":{"v":16.80013150879303,"d":"16.8"}}]
[null,{"$f":"cal!B21","v":{"v":1,"d":"100%"}},{"$f":"cal!C21","v":10},{"$f":"IF($E$8<=$E$9,\"\",cal!D21)","v":{"v":2065.4258277275967,"d":"2065"}},{"$f":"IF($E$8<=$E$9,\"\",cal!E21)","v":71},{"$f":"IF($E$8<=$E$9,\"\",cal!F21)","v":{"v":0.1559305870132709,"d":"0.16"}},{"$f":"IF($K$8>=$K$9,\"\",cal!G21)","v":{"v":221.208756594296,"d":"221"}},{"$f":"IF($K$8>=$K$9,\"\",cal!H21)","v":{"v":221.208756594296,"d":"221"}},{"$f":"IF($K$8>=$K$9,\"\",cal!I21)","v":38},{"$f":"IF($K$8>=$K$9,\"\",cal!J21)","v":{"v":0.049493533406665124,"d":"0.05"}},{"$f":"cal!K21","v":42.5},{"$f":"cal!L21","v":50.5},{"$f":"cal!M21","v":{"v":13,"d":"13.0"}},{"$f":"cal!N21","v":214},{"$f":"IF($K$8>=$K$9,\"\",cal!O21)","v":{"v":48.68625556801149,"d":"48.7"}},{"$f":"IF($K$8>=$K$9,\"\",cal!P21)","v":{"v":16.92767910599454,"d":"16.9"}}]
[null,{"$f":"cal!B22","v":"Briza Net Zero M H42 2P Высота 42 cm Ширина 14 cm Длина 95 cm (Тип 2)"}]
[null,{"$f":"cal!B23","v":{"v":0.2,"d":"20%"}},{"$f":"cal!C23","v":2},{"$f":"IF($E$8<=$E$9,cal!$Z$3,cal!D23)","v":{"v":1911.6796664330318,"d":"1912"}},{"$f":"IF($E$8<=$E$9,\"\",cal!E23)","v":66},{"$f":"IF($E$8<=$E$9,\"\",cal!F23)","v":{"v":0.1787021186706295,"d":"0.18"}},{"$f":"IF($K$8>=$K$9,cal!$Z$3,cal!G23)","v":{"v":197.61910273066172,"d":"198"}},{"$f":"IF($K$8>=$K$9,\"\",cal!H23)","v":{"v":197.61910273066172,"d":"198"}},{"$f":"IF($K$8>=$K$9,\"\",cal!I23)","v":34},{"$f":"IF($K$8>=$K$9,\"\",cal!J23)","v":{"v":0.053622434479017295,"d":"0.05"}},{"$f":"cal!K23","v":{"v":24,"d":"24.0"}},{"$f":"cal!L23","v":{"v":32,"d":"32.0"}},{"$f":"cal!M23","v":2.5},{"$f":"cal!N23","v":108},{"$f":"IF($K$8>=$K$9,\"\",cal!O23)","v":{"v":72.61013284724197,"d":"72.6"}},{"$f":"IF($K$8>=$K$9,\"\",cal!P23)","v":{"v":14.561449059500639,"d":"14.6"}}]
[null,{"$f":"cal!B24","v":{"v":0.4,"d":"40%"}},{"$f":"cal!C24","v":4},{"$f":"IF($E$8<=$E$9,cal!$Z$4,cal!D24)","v":{"v":2102.7077241964616,"d":"2103"}},{"$f":"IF($E$8<=$E$9,\"\",cal!E24)","v":72},{"$f":"IF($E$8<=$E$9,\"\",cal!F24)","v":{"v":0.20927085385147567,"d":"0.21"}},{"$f":"IF($K$8>=$K$9,cal!$Z$5,cal!G24)","v":{"v":224.5005084328207,"d":"225"}},{"$f":"IF($K$8>=$K$9,\"\",cal!H24)","v":{"v":224.5005084328207,"d":"225"}},{"$f":"IF($K$8>=$K$9,\"\",cal!I24)","v":39},{"$f":"IF($K$8>=$K$9,\"\",cal!J24)","v":{"v":0.06878333233288801,"d":"0.07"}},{"$f":"cal!K24","v":{"v":30,"d":"30.0"}},{"$f":"cal!L24","v":{"v":38,"d":"38.0"}},{"$f":"cal!M24","v":4.3},{"$f":"cal!N24","v":172},{"$f":"IF($K$8>=$K$9,\"\",cal!O24)","v":{"v":56.335278750444445,"d":"56.3"}},{"$f":"IF($K$8>=$K$9,\"\",cal!P24)","v":{"v":16.120578975549105,"d":"16.1"}}]
[null,{"$f":"cal!B25","v":{"v":0.6,"d":"60%"}},{"$f":"cal!C25","v":6},{"$f":"IF($E$8<=$E$9,\"\",cal!D25)","v":{"v":2223.6858727984295,"d":"2224"}},{"$f":"IF($E$8<=$E$9,\"\",cal!E25)","v":76},{"$f":"IF($E$8<=$E$9,\"\",cal!F25)","v":{"v":0.2308460594536478,"d":"0.23"}},{"$f":"IF($K$8>=$K$9,\"\",cal!G25)","v":{"v":260.72072762196944,"d":"261"}},{"$f":"IF($K$8>=$K$9,\"\",cal!H25)","v":{"v":260.72072762196944,"d":"261"}},{"$f":"IF($K$8>=$K$9,\"\",cal!I25)","v":45},{"$f":"IF($K$8>=$K$9,\"\",cal!J25)","v":{"v":0.08918048560215633,"d":"0.09"}},{"$f":"cal!K25","v":36.8},{"$f":"cal!L25","v":44.8},{"$f":"cal!M25","v":7.2},{"$f":"cal!N25","v":223},{"$f":"IF($K$8>=$K$9,\"\",cal!O25)","v":{"v":49.63784395097747,"d":"49.6"}},{"$f":"IF($K$8>=$K$9,\"\",cal!P25)","v":{"v":16.52504864352948,"d":"16.5"}}]
[null,{"$f":"cal!B26","v":{"v":0.8,"d":"80%"}},{"$f":"cal!C26","v":8},{"$f":"IF($E$8<=$E$9,\"\",cal!D26)","v":{"v":2775.2669612238165,"d":"2775"}},{"$f":"IF($E$8<=$E$9,\"\",cal!E26)","v":95},{"$f":"IF($E$8<=$E$9,\"\",cal!F26)","v":{"v":0.34609529231329444,"d":"0.35"}},{"$f":"IF($K$8>=$K$9,\"\",cal!G26)","v":{"v":307.01215174429893,"d":"307"}},{"$f":"IF($K$8>=$K$9,\"\",cal!H26)","v":{"v":307.01215174429893,"d":"307"}},{"$f":"IF($K$8>=$K$9,\"\",cal!I26)","v":53},{"$f":"IF($K$8>=$K$9,\"\",cal!J26)","v":{"v":0.12001521195322754,"d":"0.12"}},{"$f":"cal!K26","v":41.5},{"$f":"cal!L26","v":49.5},{"$f":"cal!M26","v":11.5},{"$f":"cal!N26","v":287},{"$f":"IF($K$8>=$K$9,\"\",cal!O26)","v":{"v":48.74093562533993,"d":"48.7"}},{"$f":"IF($K$8>=$K$9,\"\",cal!P26)","v":{"v":16.820552180108493,"d":"16.8"}}]
[null,{"$f":"cal!B27","v":{"v":1,"d":"100%"}},{"$f":"cal!C27","v":10},{"$f":"IF($E$8<=$E$9,\"\",cal!D27)","v":{"v":3401.5722821413633,"d":"3402"}},{"$f":"IF($E$8<=$E$9,\"\",cal!E27)","v":117},{"$f":"IF($E$8<=$E$9,\"\",cal!F27)","v":{"v":0.5050884849640702,"d":"0.51"}},{"$f":"IF($K$8>=$K$9,\"\",cal!G27)","v":{"v":364.1071722460002,"d":"364"}},{"$f":"IF($K$8>=$K$9,\"\",cal!H27)","v":{"v":364.1071722460002,"d":"364"}},{"$f":"IF($K$8>=$K$9,\"\",cal!I27)","v":63},{"$f":"IF($K$8>=$K$9,\"\",cal!J27)","v":{"v":0.1642345033564779,"d":"0.16"}},{"$f":"cal!K27","v":44.5},{"$f":"cal!L27","v":52.5},{"$f":"cal!M27","v":{"v":18,"d":"18.0"}},{"$f":"cal!N27","v":346},{"$f":"IF($K$8>=$K$9,\"\",cal!O27)","v":{"v":49.220095992394214,"d":"49.2"}},{"$f":"IF($K$8>=$K$9,\"\",cal!P27)","v":{"v":16.872256226802946,"d":"16.9"}}]
[null,{"$f":"cal!B28","v":"Briza Net Zero M H42 2P Высота 42 cm Ширина 14 cm Длина 125 cm (Тип 3)"}]
[null,{"$f":"cal!B29","v":{"v":0.2,"d":"20%"}},{"$f":"cal!C29","v":2},{"$f":"IF($E$8<=$E$9,cal!$Z$3,cal!D29)","v":{"v":3007.551135484291,"d":"3008"}},{"$f":"IF($E$8<=$E$9,\"\",cal!E29)","v":103},{"$f":"IF($E$8<=$E$9,\"\",cal!F29)","v":{"v":0.5412120845627276,"d":"0.54"}},{"$f":"IF($K$8>=$K$9,cal!$Z$3,cal!G29)","v":{"v":323.85511824960383,"d":"324"}},{"$f":"IF($K$8>=$K$9,\"\",cal!H29)","v":{"v":323.85511824960383,"d":"324"}},{"$f":"IF($K$8>=$K$9,\"\",cal!I29)","v":56},{"$f":"IF($K$8>=$K$9,\"\",cal!J29)","v":{"v":0.17912036891354097,"d":"0.18"}},{"$f":"cal!K29","v":24.6},{"$f":"cal!L29","v":32.6},{"$f":"cal!M29","v":2.6},{"$f":"cal!N29","v":146},{"$f":"IF($K$8>=$K$9,\"\",cal!O29)","v":{"v":81.22632570154698,"d":"81.2"}},{"$f":"IF($K$8>=$K$9,\"\",cal!P29)","v":{"v":13.407108289492015,"d":"13.4"}}]
[null,{"$f":"cal!B30","v":{"v":0.4,"d":"40%"}},{"$f":"cal!C30","v":4},{"$f":"IF($E$8<=$E$9,cal!$Z$4,cal!D30)","v":{"v":3361.6414880914385,"d":"3362"}},{"$f":"IF($E$8<=$E$9,\"\",cal!E30)","v":116},{"$f":"IF($E$8<=$E$9,\"\",cal!F30)","v":{"v":0.6714854225113867,"d":"0.67"}},{"$f":"IF($K$8>=$K$9,cal!$Z$5,cal!G30)","v":{"v":358.5314353810638,"d":"359"}},{"$f":"IF($K$8>=$K$9,\"\",cal!H30)","v":{"v":358.5314353810638,"d":"359"}},{"$f":"IF($K$8>=$K$9,\"\",cal!I30)","v":62},{"$f":"IF($K$8>=$K$9,\"\",cal!J30)","v":{"v":0.21545435821484804,"d":"0.22"}},{"$f":"cal!K30","v":{"v":30.200000000000003,"d":"30.2"}},{"$f":"cal!L30","v":38.2},{"$f":"cal!M30","v":4.8},{"$f":"cal!N30","v":221},{"$f":"IF($K$8>=$K$9,\"\",cal!O30)","v":{"v":65.2102755945543,"d":"65.2"}},{"$f":"IF($K$8>=$K$9,\"\",cal!P30)","v":{"v":15.1781577362398,"d":"15.2"}}]
[null,{"$f":"cal!B31","v":{"v":0.6,"d":"60%"}},{"$f":"cal!C31","v":6},{"$f":"IF($E$8<=$E$9,\"\",cal!D31)","v":{"v":3822.655355582246,"d":"3823"}},{"$f":"IF($E$8<=$E$9,\"\",cal!E31)","v":131},{"$f":"IF($E$8<=$E$9,\"\",cal!F31)","v":{"v":0.8372779119001486,"d":"0.84"}},{"$f":"IF($K$8>=$K$9,\"\",cal!G31)","v":{"v":409.1737721239133,"d":"409"}},{"$f":"IF($K$8>=$K$9,\"\",cal!H31)","v":{"v":409.1737721239133,"d":"409"}},{"$f":"IF($K$8>=$K$9,\"\",cal!I31)","v":70},{"$f":"IF($K$8>=$K$9,\"\",cal!J31)","v":{"v":0.2685308896463024,"d":"0.27"}},{"$f":"cal!K31","v":{"v":37,"d":"37.0"}},{"$f":"cal!L31","v":{"v":45,"d":"45.0"}},{"$f":"cal!M31","v":{"v":8,"d":"8.0"}},{"$f":"cal!N31","v":298},{"$f":"IF($K$8>=$K$9,\"\",cal!O31)","v":{"v":58.12649776411239,"d":"58.1"}},{"$f":"IF($K$8>=$K$9,\"\",cal!P31)","v":{"v":15.91897216545182,"d":"15.9"}}]
[null,{"$f":"cal!B32","v":{"v":0.8,"d":"80%"}},{"$f":"cal!C32","v":8},{"$f":"IF($E$8<=$E$9,\"\",cal!D32)","v":{"v":4475.27024866499,"d":"4475"}},{"$f":"IF($E$8<=$E$9,\"\",cal!E32)","v":154},{"$f":"IF($E$8<=$E$9,\"\",cal!F32)","v":{"v":1.122901357846333,"d":"1.12"}},{"$f":"IF($K$8>=$K$9,\"\",cal!G32)","v":{"v":480.52967679906385,"d":"481"}},{"$f":"IF($K$8>=$K$9,\"\",cal!H32)","v":{"v":480.52967679906385,"d":"481"}},{"$f":"IF($K$8>=$K$9,\"\",cal!I32)","v":83},{"$f":"IF($K$8>=$K$9,\"\",cal!J32)","v":{"v":0.3657932435979751,"d":"0.37"}},{"$f":"cal!K32","v":42.5},{"$f":"cal!L32","v":50.5},{"$f":"cal!M32","v":{"v":14,"d":"14.0"}},{"$f":"cal!N32","v":381},{"$f":"IF($K$8>=$K$9,\"\",cal!O32)","v":{"v":54.911806649820356,"d":"54.9"}},{"$f":"IF($K$8>=$K$9,\"\",cal!P32)","v":{"v":16.25136399954527,"d":"16.3"}}]
[null,{"$f":"cal!B33","v":{"v":1,"d":"100%"}},{"$f":"cal!C33","v":10},{"$f":"IF($E$8<=$E$9,\"\",cal!D33)","v":{"v":5402.90999608246,"d":"5403"}},{"$f":"IF($E$8<=$E$9,\"\",cal!E33)","v":186},{"$f":"IF($E$8<=$E$9,\"\",cal!F33)","v":{"v":1.5816909181382854,"d":"1.58"}},{"$f":"IF($K$8>=$K$9,\"\",cal!G33)","v":{"v":577.3466977274268,"d":"577"}},{"$f":"IF($K$8>=$K$9,\"\",cal!H33)","v":{"v":577.3466977274268,"d":"577"}},{"$f":"IF($K$8>=$K$9,\"\",cal!I33)","v":99},{"$f":"IF($K$8>=$K$9,\"\",cal!J33)","v":{"v":0.5036783996848484,"d":"0.50"}},{"$f":"cal!K33","v":{"v":47,"d":"47.0"}},{"$f":"cal!L33","v":{"v":55,"d":"55.0"}},{"$f":"cal!M33","v":{"v":24,"d":"24.0"}},{"$f":"cal!N33","v":448},{"$f":"IF($K$8>=$K$9,\"\",cal!O33)","v":{"v":55.84493127608798,"d":"55.8"}},{"$f":"IF($K$8>=$K$9,\"\",cal!P33)","v":{"v":16.169665473324294,"d":"16.2"}}]
[null,{"$f":"cal!B34","v":"Briza Net Zero M H42 2P Высота 42 cm Ширина 14 cm Длина 145 cm (Тип 4)"}]
[null,{"$f":"cal!B35","v":{"v":0.2,"d":"20%"}},{"$f":"cal!C35","v":2},{"$f":"IF($E$8<=$E$9,cal!$Z$3,cal!D35)","v":{"v":3710.2518300192883,"d":"3710"}},{"$f":"IF($E$8<=$E$9,\"\",cal!E35)","v":128},{"$f":"IF($E$8<=$E$9,\"\",cal!F35)","v":{"v":0.9257190017234551,"d":"0.93"}},{"$f":"IF($K$8>=$K$9,cal!$Z$3,cal!G35)","v":{"v":425.28072036719897,"d":"425"}},{"$f":"IF($K$8>=$K$9,\"\",cal!H35)","v":{"v":425.28072036719897,"d":"425"}},{"$f":"IF($K$8>=$K$9,\"\",cal!I35)","v":73},{"$f":"IF($K$8>=$K$9,\"\",cal!J35)","v":{"v":0.33138216699846984,"d":"0.33"}},{"$f":"cal!K35","v":{"v":25.700000000000003,"d":"25.7"}},{"$f":"cal!L35","v":33.7},{"$f":"cal!M35","v":2.8},{"$f":"cal!N35","v":173},{"$f":"IF($K$8>=$K$9,\"\",cal!O35)","v":{"v":83.74341371389056,"d":"83.7"}},{"$f":"IF($K$8>=$K$9,\"\",cal!P35)","v":{"v":12.693529672683475,"d":"12.7"}}]
[null,{"$f":"cal!B36","v":{"v":0.4,"d":"40%"}},{"$f":"cal!C36","v":4},{"$f":"IF($E$8<=$E$9,cal!$Z$4,cal!D36)","v":{"v":4208.154813438636,"d":"4208"}},{"$f":"IF($E$8<=$E$9,\"\",cal!E36)","v":145},{"$f":"IF($E$8<=$E$9,\"\",cal!F36)","v":{"v":1.162926054531533,"d":"1.16"}},{"$f":"IF($K$8>=$K$9,cal!$Z$5,cal!G36)","v":{"v":465.31120093510003,"d":"465"}},{"$f":"IF($K$8>=$K$9,\"\",cal!H36)","v":{"v":465.31120093510003,"d":"465"}},{"$f":"IF($K$8>=$K$9,\"\",cal!I36)","v":80},{"$f":"IF($K$8>=$K$9,\"\",cal!J36)","v":{"v":0,"d":"0.00"}},{"$f":"cal!K36","v":30.5},{"$f":"cal!L36","v":38.5},{"$f":"cal!M36","v":5.5},{"$f":"cal!N36","v":268},{"$f":"IF($K$8>=$K$9,\"\",cal!O36)","v":{"v":66.66969339926595,"d":"66.7"}},{"$f":"IF($K$8>=$K$9,\"\",cal!P36)","v":{"v":14.839559843773792,"d":"14.8"}}]
[null,{"$f":"cal!B37","v":{"v":0.6,"d":"60%"}},{"$f":"cal!C37","v":6},{"$f":"IF($E$8<=$E$9,\"\",cal!D37)","v":{"v":4818.46485209771,"d":"4818"}},{"$f":"IF($E$8<=$E$9,\"\",cal!E37)","v":166},{"$f":"IF($E$8<=$E$9,\"\",cal!F37)","v":{"v":1.4893854648207197,"d":"1.49"}},{"$f":"IF($K$8>=$K$9,\"\",cal!G37)","v":{"v":521.7420939012173,"d":"522"}},{"$f":"IF($K$8>=$K$9,\"\",cal!H37)","v":{"v":521.7420939012173,"d":"522"}},{"$f":"IF($K$8>=$K$9,\"\",cal!I37)","v":90},{"$f":"IF($K$8>=$K$9,\"\",cal!J37)","v":{"v":0,"d":"0.00"}},{"$f":"cal!K37","v":37.3},{"$f":"cal!L37","v":45.3},{"$f":"cal!M37","v":10.3},{"$f":"cal!N37","v":373},{"$f":"IF($K$8>=$K$9,\"\",cal!O37)","v":{"v":58.39528509815356,"d":"58.4"}},{"$f":"IF($K$8>=$K$9,\"\",cal!P37)","v":{"v":15.84256873134111,"d":"15.8"}}]
[null,{"$f":"cal!B38","v":{"v":0.8,"d":"80%"}},{"$f":"cal!C38","v":8},{"$f":"IF($E$8<=$E$9,\"\",cal!D38)","v":{"v":5630.971338663313,"d":"5631"}},{"$f":"IF($E$8<=$E$9,\"\",cal!E38)","v":194},{"$f":"IF($E$8<=$E$9,\"\",cal!F38)","v":{"v":1.9808023009466225,"d":"1.98"}},{"$f":"IF($K$8>=$K$9,\"\",cal!G38)","v":{"v":603.8147078539628,"d":"604"}},{"$f":"IF($K$8>=$K$9,\"\",cal!H38)","v":{"v":603.8147078539628,"d":"604"}},{"$f":"IF($K$8>=$K$9,\"\",cal!I38)","v":104},{"$f":"IF($K$8>=$K$9,\"\",cal!J38)","v":{"v":0,"d":"0.00"}},{"$f":"cal!K38","v":{"v":43,"d":"43.0"}},{"$f":"cal!L38","v":{"v":51,"d":"51.0"}},{"$f":"cal!M38","v":18.5},{"$f":"cal!N38","v":466},{"$f":"IF($K$8>=$K$9,\"\",cal!O38)","v":{"v":55.914963818085226,"d":"55.9"}},{"$f":"IF($K$8>=$K$9,\"\",cal!P38)","v":{"v":16.14880238574423,"d":"16.1"}}]
[null,{"$f":"cal!B39","v":{"v":1,"d":"100%"}},{"$f":"cal!C39","v":10},{"$f":"IF($E$8<=$E$9,\"\",cal!D39)","v":{"v":6735.463665802251,"d":"6735"}},{"$f":"IF($E$8<=$E$9,\"\",cal!E39)","v":232},{"$f":"IF($E$8<=$E$9,\"\",cal!F39)","v":{"v":2.7476090674788978,"d":"2.75"}},{"$f":"IF($K$8>=$K$9,\"\",cal!G39)","v":{"v":720.7703513817482,"d":"721"}},{"$f":"IF($K$8>=$K$9,\"\",cal!H39)","v":{"v":720.7703513817482,"d":"721"}},{"$f":"IF($K$8>=$K$9,\"\",cal!I39)","v":124},{"$f":"IF($K$8>=$K$9,\"\",cal!J39)","v":{"v":0,"d":"0.00"}},{"$f":"cal!K39","v":{"v":47,"d":"47.0"}},{"$f":"cal!L39","v":{"v":55,"d":"55.0"}},{"$f":"cal!M39","v":28.8},{"$f":"cal!N39","v":510},{"$f":"IF($K$8>=$K$9,\"\",cal!O39)","v":{"v":59.253225997555376,"d":"59.3"}},{"$f":"IF($K$8>=$K$9,\"\",cal!P39)","v":{"v":15.799463422425681,"d":"15.8"}}]
[null,{"$f":"cal!B46","v":"*Звуковая мощность определена по ISO 3741:2010"},{"$nulls":13},"v2024-09-25"]
[null,{"$f":"cal!B47","v":"***Уровень звукового давления (при постоянной помещения 8 дБ(A))"}]

{"sheet":"cal","index":1,"n_rows":47,"n_cols":86,"rows_kept":47,"hidden":true,"merged":[[2,6,2,9],[4,6,4,9],[6,12,6,13],[7,12,7,13],[8,1,8,3],[8,6,8,9],[8,12,8,13],[9,1,9,3],[9,6,9,9],[10,1,10,3],[10,6,10,9],[15,1,15,15],[15,22,15,28],[15,30,15,36],[15,37,15,43],[15,44,15,50],[15,51,15,57],[15,58,15,64],[15,65,15,71],[15,72,15,78],[15,79,15,85],[21,1,21,15],[27,1,27,15],[33,1,33,15],[39,1,39,15]]}
[{"$nulls":4},"Nederlands","English","Deutsch","Français","Norsk","Español","Svenska","Čeština","Русский","ExtraTaal2","ExtraTaal3",{"$nulls":8},{"$f":"'Briza Net Zero'!K4:M4","v":"Briza Net Zero M H42 2P"},0,0,{"$f":"IF('Briza Net Zero'!$K$4=cal!$X2,1,IF('Briza Net Zero'!$K$4=cal!$X3,1,IF('Briza Net Zero'!$K$4=cal!$X4,2,IF('Briza Net Zero'!$K$4=cal!$X5,2,IF('Briza Net Zero'!$K$4=cal!$X6,2,IF('Briza Net Zero'!$K$4=cal!$X7,2,IF('Briza Net Zero'!$K$4=cal!$X8,7,IF('Briza Net Zero'!$K$4=cal!$X9,8,))))))))","v":2},{"$nulls":6},{"$f":"'Briza Net Zero'!K2","v":"Русский"},{"$f":"'Briza Net Zero'!N4","v":"Настенный"},null,null,"Briza xs",null,"Briza s",null,"Briza M 42",null,"Briza M 56"]
[{"$nulls":23},"Briza Net Zero XS",{"$nulls":9},{"$f":"IF(AH$1=\"English\",\"Wall\",IF(AH$1=\"Nederlands\",\"Wand\",IF(AH$1=\"Deutch\",\"Wand\",IF(AH$1=\"Français\",\"Mur\",IF(AH$1=\"Español\",\"Muro\",IF(AH$1=\"Svenska\",\"Vägg\",IF(AH$1=\"Русский\",\"Настенный\",IF(AH$1=\"Čeština\",\"Stěna\",\"Error\"))))))))","v":"Настенный"},{"$nulls":3},"wall","ceiling","wall","ceiling","wall","ceiling","wall","ceiling"]
[null,{"$f":"IF($S$7=1,NL!B3,IF(cal!$S$7=2,EN!B3,IF(cal!$S$7=3,DE!B3,IF(cal!$S$7=4,FR!B3,IF(cal!$S$7=5,NR!B3,IF(cal!$S$7=6,SP!B3,IF(cal!$S$7=7,SW!B3,IF(cal!$S$7=8,TS!B3,IF(cal!$S$7=9,RU!B3,IF(cal!$S$7=10,ExtraTaal2!B3,IF(cal!$S$7=11,ExtraTaal3!B3,)))))))))))","v":"Formulary"},{"$nulls":21},"Briza Net Zero S",null,{"$f":"IF($S$7=1,NL!R16,IF(cal!$S$7=2,EN!R16,IF(cal!$S$7=3,DE!R16,IF(cal!$S$7=4,FR!R16,IF(cal!$S$7=5,NR!R16,IF(cal!$S$7=6,SP!R16,IF(cal!$S$7=7,SW!R16,IF(cal!$S$7=8,TS!R16,IF(cal!$S$7=9,RU!R16,IF(cal!$S$7=10,ExtraTaal2!R16,IF(cal!$S$7=11,ExtraTaal3!R16,)))))))))))","v":"Темп."},{"$f":"IF($S$7=1,NL!Q7,IF(cal!$S$7=2,EN!Q7,IF(cal!$S$7=3,DE!Q7,IF(cal!$S$7=4,FR!Q7,IF(cal!$S$7=5,NR!Q7,IF(cal!$S$7=6,SP!Q7,IF(cal!$S$7=7,SW!Q7,IF(cal!$S$7=8,TS!Q7,IF(cal!$S$7=9,RU!Q7,IF(cal!$S$7=10,ExtraTaal2!Q7,IF(cal!$S$7=11,ExtraTaal3!Q7,)))))))))))","v":"Скопировать подбор"},{"$nulls":6},{"$f":"IF(AH$1=\"English\",\"Ceiling\",IF(AH$1=\"Nederlands\",\"Plafond\",IF(AH$1=\"Deutch\",\"Decke\",IF(AH$1=\"Français\",\"Plafond\",IF(AH$1=\"Norsk\",\"Tak\",IF(AH$1=\"Español\",\"Techo\",IF(AH$1=\"Svenska\",\"Tak\",IF(AH$1=\"Русский\",\"Потолочный\",IF(AH$1=\"Čeština\",\"Strop\",\"Error\")))))))))","v":"Потолочный"},null,null,"dikte",8.5,8.5,11,11.5,14,16,14,16]
[{"$nulls":22},1,"Briza Net Zero M H42 2P",null,{"$f":"IF($S$7=1,NL!R17,IF(cal!$S$7=2,EN!R17,IF(cal!$S$7=3,DE!R17,IF(cal!$S$7=4,FR!R17,IF(cal!$S$7=5,NR!R17,IF(cal!$S$7=6,SP!R17,IF(cal!$S$7=7,SW!R17,IF(cal!$S$7=8,TS!R17,IF(cal!$S$7=9,RU!R17,IF(cal!$S$7=10,ExtraTaal2!R17,IF(cal!$S$7=11,ExtraTaal3!R17,)))))))))))","v":"Обогрев!"},{"$f":"IF($S$7=1,NL!Q8,IF(cal!$S$7=2,EN!Q8,IF(cal!$S$7=3,DE!Q8,IF(cal!$S$7=4,FR!Q8,IF(cal!$S$7=5,NR!Q8,IF(cal!$S$7=6,SP!Q8,IF(cal!$S$7=7,SW!Q8,IF(cal!$S$7=8,TS!Q8,IF(cal!$S$7=9,RU!Q8,IF(cal!$S$7=10,ExtraTaal2!Q8,IF(cal!$S$7=11,ExtraTaal3!Q8,)))))))))))","v":"Система СИ"},{"$nulls":9},"hoogte",52.1,53.4,55.8,58.9,42,42,56,56]
[null,{"$f":"IF($S$7=1,NL!B5,IF(cal!$S$7=2,EN!B5,IF(cal!$S$7=3,DE!B5,IF(cal!$S$7=4,FR!B5,IF(cal!$S$7=5,NR!B5,IF(cal!$S$7=6,SP!B5,IF(cal!$S$7=7,SW!B5,IF(cal!$S$7=8,TS!B5,IF(cal!$S$7=9,RU!B5,IF(cal!$S$7=10,ExtraTaal2!B5,IF(cal!$S$7=11,ExtraTaal3!B5,)))))))))))","v":"Conditions"},{"$nulls":21},"Briza Net Zero M H42 4P",null,{"$f":"IF($S$7=1,NL!R18,IF(cal!$S$7=2,EN!R18,IF(cal!$S$7=3,DE!R18,IF(cal!$S$7=4,FR!R18,IF(cal!$S$7=5,NR!R18,IF(cal!$S$7=6,SP!R18,IF(cal!$S$7=7,SW!R18,IF(cal!$S$7=8,TS!R18,IF(cal!$S$7=9,RU!R18,IF(cal!$S$7=10,ExtraTaal2!R18,IF(cal!$S$7=11,ExtraTaal3!R18,)))))))))))","v":"Охлаждение!"},{"$f":"IF($S$7=1,NL!Q9,IF(cal!$S$7=2,EN!Q9,IF(cal!$S$7=3,DE!Q9,IF(cal!$S$7=4,FR!Q9,IF(cal!$S$7=5,NR!Q9,IF(cal!$S$7=6,SP!Q9,IF(cal!$S$7=7,SW!Q9,IF(cal!$S$7=8,TS!Q9,IF(cal!$S$7=9,RU!Q9,IF(cal!$S$7=10,ExtraTaal2!Q9,IF(cal!$S$7=11,ExtraTaal3!Q9,)))))))))))","v":"Английская система мер"},{"$nulls":8},"lengte","T1",86,86,75,90,75,75,75,75]
[{"$nulls":23},"Briza Net Zero M H56 2P",{"$nulls":12},"T2",122,122,110,125,95,95,95,95]
[null,{"$f":"IF($S$7=1,NL!B7,IF(cal!$S$7=2,EN!B7,IF(cal!$S$7=3,DE!B7,IF(cal!$S$7=4,FR!B7,IF(cal!$S$7=5,NR!B7,IF(cal!$S$7=6,SP!B7,IF(cal!$S$7=7,SW!B7,IF(cal!$S$7=8,TS!B7,IF(cal!$S$7=9,RU!B7,IF(cal!$S$7=10,ExtraTaal2!B7,IF(cal!$S$7=11,ExtraTaal3!B7,)))))))))))","v":"Температура"},{"$nulls":10},{"$f":"IF($S$7=8,\"Výška umístění\",\"h_atm\")","v":"h_atm"},{"$nulls":5},{"$f":"IF('Briza Net Zero'!$K$2=cal!$E$1,1,IF('Briza Net Zero'!$K$2=cal!$F$1,2,IF('Briza Net Zero'!$K$2=cal!G1,3,IF('Briza Net Zero'!$K$2=cal!H1,4,IF('Briza Net Zero'!$K$2=cal!I1,5,IF('Briza Net Zero'!$K$2=cal!J1,6,IF('Briza Net Zero'!$K$2=cal!K1,7,IF('Briza Net Zero'!$K$2=cal!L1,8,IF('Briza Net Zero'!$K$2=cal!M1,9,IF('Briza Net Zero'!$K$2=cal!N1,10,IF('Briza Net Zero'!$K$2=cal!O1,11,)))))))))))","v":9},{"$nulls":4},"Briza Net Zero M H56 4P",{"$nulls":12},"T3",163,163,155,170,125,125,125,125]
[null,{"$f":"IF($S$7=1,NL!B8,IF(cal!$S$7=2,EN!B8,IF(cal!$S$7=3,DE!B8,IF(cal!$S$7=4,FR!B8,IF(cal!$S$7=5,NR!B8,IF(cal!$S$7=6,SP!B8,IF(cal!$S$7=7,SW!B8,IF(cal!$S$7=8,TS!B8,IF(cal!$S$7=9,RU!B8,IF(cal!$S$7=10,ExtraTaal2!B8,IF(cal!$S$7=11,ExtraTaal3!B8,)))))))))))","v":"Обогрев:"},{"$nulls":4},{"$f":"IF($S$7=1,NL!G8,IF(cal!$S$7=2,EN!G8,IF(cal!$S$7=3,DE!G8,IF(cal!$S$7=4,FR!G8,IF(cal!$S$7=5,NR!G8,IF(cal!$S$7=6,SP!G8,IF(cal!$S$7=7,SW!G8,IF(cal!$S$7=8,TS!G8,IF(cal!$S$7=9,RU!G8,IF(cal!$S$7=10,ExtraTaal2!G8,IF(cal!$S$7=11,ExtraTaal3!G8,)))))))))))","v":"Охлаждение:"},{"$nulls":5},{"$f":"'Briza Net Zero'!M7","v":{"v":0,"d":"0.00"}},{"$f":"'Briza Net Zero'!N7","v":{"v":0,"d":"0.00"}},{"$nulls":4},"Temp",{"$nulls":3},"Temp","Briza 12 H55 2P casing",{"$nulls":12},"T4",199,199,190,205,145,145,145,145]
[null,{"$f":"IF($S$7=1,NL!B9,IF(cal!$S$7=2,EN!B9,IF(cal!$S$7=3,DE!B9,IF(cal!$S$7=4,FR!B9,IF(cal!$S$7=5,NR!B9,IF(cal!$S$7=6,SP!B9,IF(cal!$S$7=7,SW!B9,IF(cal!$S$7=8,TS!B9,IF(cal!$S$7=9,RU!B9,IF(cal!$S$7=10,ExtraTaal2!B9,IF(cal!$S$7=11,ExtraTaal3!B9,)))))))))))","v":"Темп.подачи"},{"$f":"IF($S$7=1,NL!C9,IF(cal!$S$7=2,EN!C9,IF(cal!$S$7=3,DE!C9,IF(cal!$S$7=4,FR!C9,IF(cal!$S$7=5,NR!C9,IF(cal!$S$7=6,SP!C9,IF(cal!$S$7=7,SW!C9,IF(cal!$S$7=8,TS!C9,IF(cal!$S$7=9,RU!C9,IF(cal!$S$7=10,ExtraTaal2!C9,IF(cal!$S$7=11,ExtraTaal3!C9,)))))))))))","v":0},{"$f":"IF($S$7=1,NL!D9,IF(cal!$S$7=2,EN!D9,IF(cal!$S$7=3,DE!D9,IF(cal!$S$7=4,FR!D9,IF(cal!$S$7=5,NR!D9,IF(cal!$S$7=6,SP!D9,IF(cal!$S$7=7,SW!D9,IF(cal!$S$7=8,TS!D9,IF(cal!$S$7=9,RU!D9,IF(cal!$S$7=10,ExtraTaal2!D9,IF(cal!$S$7=11,ExtraTaal3!D9,)))))))))))","v":0},{"$f":"'Briza Net Zero'!E8","v":95},{"$f":"IF($W$4=1,\"°C\",IF($W$4=2,\"°F\",))","v":"°C"},{"$f":"B9","v":"Темп.подачи"},{"$f":"IF($S$7=1,NL!H9,IF(cal!$S$7=2,EN!H9,IF(cal!$S$7=3,DE!H9,IF(cal!$S$7=4,FR!H9,))))","v":0},{"$f":"IF($S$7=1,NL!I9,IF(cal!$S$7=2,EN!I9,IF(cal!$S$7=3,DE!I9,IF(cal!$S$7=4,FR!I9,))))","v":0},{"$f":"IF($S$7=1,NL!J9,IF(cal!$S$7=2,EN!J9,IF(cal!$S$7=3,DE!J9,IF(cal!$S$7=4,FR!J9,))))","v":0},{"$f":"'Briza Net Zero'!K8","v":{"v":7.000000000000001,"d":"7"}},{"$f":"F9","v":"°C"},{"$f":"IF($S$7=1,NL!M9,IF(cal!$S$7=2,EN!M9,IF(cal!$S$7=3,DE!M9,IF(cal!$S$7=4,FR!M9,IF(cal!$S$7=5,NR!M9,IF(cal!$S$7=6,SP!M9,))))))","v":0},{"$f":"IF($S$7=1,NL!N9,IF(cal!$S$7=2,EN!N9,IF(cal!$S$7=3,DE!N9,IF(cal!$S$7=4,FR!N9,IF(cal!$S$7=5,#REF!,)))))","v":0},{"$nulls":4},{"$f":"IF($W$4=1,E9,IF($W$4=2,(E9-32)/1.8))","v":{"v":95,"d":"95.0"}},{"$nulls":3},{"$f":"IF($W$4=1,K9,IF($W$4=2,(K9-32)/1.8))","v":{"v":7.000000000000001,"d":"7.0"}},"Briza 12 H55 4P casing"]
[null,{"$f":"IF($S$7=1,NL!B10,IF(cal!$S$7=2,EN!B10,IF(cal!$S$7=3,DE!B10,IF(cal!$S$7=4,FR!B10,IF(cal!$S$7=5,NR!B10,IF(cal!$S$7=6,SP!B10,IF(cal!$S$7=7,SW!B10,IF(cal!$S$7=8,TS!B10,IF(cal!$S$7=9,RU!B10,IF(cal!$S$7=10,ExtraTaal2!B10,IF(cal!$S$7=11,ExtraTaal3!B10,)))))))))))","v":"Темп.обратная"},{"$f":"IF($S$7=1,NL!C10,IF(cal!$S$7=2,EN!C10,IF(cal!$S$7=3,DE!C10,IF(cal!$S$7=4,FR!C10,IF(cal!$S$7=5,NR!C10,IF(cal!$S$7=6,SP!C10,IF(cal!$S$7=7,SW!C10,IF(cal!$S$7=8,TS!C10,IF(cal!$S$7=9,RU!C10,IF(cal!$S$7=10,ExtraTaal2!C10,IF(cal!$S$7=11,ExtraTaal3!C10,)))))))))))","v":0},{"$f":"IF($S$7=1,NL!D10,IF(cal!$S$7=2,EN!D10,IF(cal!$S$7=3,DE!D10,IF(cal!$S$7=4,FR!D10,IF(cal!$S$7=5,NR!D10,IF(cal!$S$7=6,SP!D10,IF(cal!$S$7=7,SW!D10,IF(cal!$S$7=8,TS!D10,IF(cal!$S$7=9,RU!D10,IF(cal!$S$7=10,ExtraTaal2!D10,IF(cal!$S$7=11,ExtraTaal3!D10,)))))))))))","v":0},{"$f":"'Briza Net Zero'!E9","v":70},{"$f":"F9","v":"°C"},{"$f":"B10","v":"Темп.обратная"},{"$f":"IF($S$7=1,NL!H10,IF(cal!$S$7=2,EN!H10,IF(cal!$S$7=3,DE!H10,IF(cal!$S$7=4,FR!H10,))))","v":0},{"$f":"IF($S$7=1,NL!I10,IF(cal!$S$7=2,EN!I10,IF(cal!$S$7=3,DE!I10,IF(cal!$S$7=4,FR!I10,))))","v":0},{"$f":"IF($S$7=1,NL!J10,IF(cal!$S$7=2,EN!J10,IF(cal!$S$7=3,DE!J10,IF(cal!$S$7=4,FR!J10,))))","v":0},{"$f":"'Briza Net Zero'!K9","v":12},{"$f":"F9","v":"°C"},{"$nulls":6},{"$f":"IF($W$4=1,E10,IF($W$4=2,(E10-32)/1.8))","v":{"v":70,"d":"70.0"}},{"$nulls":3},{"$f":"IF($W$4=1,K10,IF($W$4=2,(K10-32)/1.8))","v":{"v":12,"d":"12.0"}},null,"p_atm","h[mm]","cf_h"]
[null,{"$f":"IF($S$7=1,NL!B11,IF(cal!$S$7=2,EN!B11,IF(cal!$S$7=3,DE!B11,IF(cal!$S$7=4,FR!B11,IF(cal!$S$7=5,NR!B11,IF(cal!$S$7=6,SP!B11,IF(cal!$S$7=7,SW!B11,IF(cal!$S$7=8,TS!B11,IF(cal!$S$7=9,RU!B11,IF(cal!$S$7=10,ExtraTaal2!B11,IF(cal!$S$7=11,ExtraTaal3!B11,)))))))))))","v":"Темп.воздуха"},{"$f":"IF($S$7=1,NL!C11,IF(cal!$S$7=2,EN!C11,IF(cal!$S$7=3,DE!C11,IF(cal!$S$7=4,FR!C11,IF(cal!$S$7=5,NR!C11,IF(cal!$S$7=6,SP!C11,IF(cal!$S$7=7,SW!C11,IF(cal!$S$7=8,TS!C11,IF(cal!$S$7=9,RU!C11,IF(cal!$S$7=10,ExtraTaal2!C11,IF(cal!$S$7=11,ExtraTaal3!C11,)))))))))))","v":0},{"$f":"IF($S$7=1,NL!D11,IF(cal!$S$7=2,EN!D11,IF(cal!$S$7=3,DE!D11,IF(cal!$S$7=4,FR!D11,IF(cal!$S$7=5,NR!D11,IF(cal!$S$7=6,SP!D11,IF(cal!$S$7=7,SW!D11,IF(cal!$S$7=8,TS!D11,IF(cal!$S$7=9,RU!D11,IF(cal!$S$7=10,ExtraTaal2!D11,IF(cal!$S$7=11,ExtraTaal3!D11,)))))))))))","v":0},{"$f":"'Briza Net Zero'!E10","v":20},{"$f":"F9","v":"°C"},{"$f":"B11","v":"Темп.воздуха"},{"$f":"IF($S$7=1,NL!H11,IF(cal!$S$7=2,EN!H11,IF(cal!$S$7=3,DE!H11,IF(cal!$S$7=4,FR!H11,))))","v":0},null,null,{"$f":"'Briza Net Zero'!K10","v":20},{"$f":"F9","v":"°C"},{"$nulls":6},{"v":20,"d":"20.0"},{"$nulls":3},{"v":20,"d":"20.0"},null,{"$f":"IF($W$4=1,(101325*(1-((0.0065*M8)/(288.15)))^((9.81*0.028964)/(8.31447*0.0065))),IF($W$4=2,(101325*(1-((0.0065*(M8*0.3048))/(288.15)))^((9.81*0.028964)/(8.31447*0.0065)))))","v":101325},{"$f":"IF($W$4=1,M8/1000,IF($W$4=2,M8*0.0003048))","v":0},{"$f":"-(0.000265264729874266*Z11^6)+(0.000957582908802335*Z11^5)+(0.00470250661483425*Z11^4)-(0.0298716926548353*Z11^3)+(0.0557086806557086*Z11^2)-(0.0484008125693582*Z11)+1","v":1}]
[{"$nulls":6},{"$f":"IF($S$7=1,NL!G12,IF(cal!$S$7=2,EN!G12,IF(cal!$S$7=3,DE!G12,IF(cal!$S$7=4,FR!G12,IF(cal!$S$7=5,NR!G12,IF(cal!$S$7=6,SP!G12,IF(cal!$S$7=7,SW!G12,IF(cal!$S$7=8,TS!G12,IF(cal!$S$7=9,RU!G12,IF(cal!$S$7=10,ExtraTaal2!G12,IF(cal!$S$7=11,ExtraTaal3!G12,)))))))))))","v":"Влажность"},{"$nulls":3},{"$f":"'Briza Net Zero'!K11","v":{"v":0.5,"d":"50%"}}]
[]
[{"$nulls":3},{"$f":"IF($W$4=1,1,IF($W$4=2,3.412141633))","v":{"v":1,"d":"1.0000"}},{"$f":"IF($W$4=1,1,IF($W$4=2,0.004403))","v":{"v":1,"d":"1.0000"}},{"$f":"IF($W$4=1,1,IF($W$4=2,4.0147))","v":{"v":1,"d":"1.0000"}},{"$f":"IF($W$4=1,1,IF($W$4=2,3.412141633))","v":{"v":1,"d":"1.0000"}},{"v":1,"d":"1.0000"},{"$f":"IF($W$4=1,1,IF($W$4=2,0.004403))","v":{"v":1,"d":"1.0000"}},{"$f":"IF($W$4=1,1,IF($W$4=2,4.0147))","v":{"v":1,"d":"1.0000"}},{"$f":"IF($W$4=1,0.000334444444444444,IF($W$4=2,0.000568224721372))","v":0.000334444444444444},null,{"$f":"IF($W$4=1,1,IF($W$4=2,1.8))","v":1},{"$f":"IF($W$4=1,1,IF($W$4=2,0.588575))","v":{"v":1,"d":"1.0000"}},{"$f":"IF($W$4=1,0,IF($W$4=2,32))","v":{"v":0,"d":"0.0000"}}]
[null,{"$f":"IF($S$7=1,NL!B15,IF(cal!$S$7=2,EN!B15,IF(cal!$S$7=3,DE!B15,IF(cal!$S$7=4,FR!B15,IF(cal!$S$7=5,NR!B15,IF(cal!$S$7=6,SP!B15,IF(cal!$S$7=7,SW!B15,IF(cal!$S$7=8,TS!B15,IF(cal!$S$7=9,RU!B15,IF(cal!$S$7=10,ExtraTaal2!B15,IF(cal!$S$7=11,ExtraTaal3!B15,)))))))))))","v":"Скорость вентилятора"},{"$f":"IF($S$7=1,NL!C15,IF(cal!$S$7=2,EN!C15,IF(cal!$S$7=3,DE!C15,IF(cal!$S$7=4,FR!C15,IF(cal!$S$7=5,NR!C15,IF(cal!$S$7=6,SP!C15,IF(cal!$S$7=7,SW!C15,IF(cal!$S$7=8,TS!C15,IF(cal!$S$7=9,RU!C15,IF(cal!$S$7=10,ExtraTaal2!C15,IF(cal!$S$7=11,ExtraTaal3!C15,)))))))))))","v":"Управляющий сигнал [V]"},{"$f":"IF($S$7=1,NL!D15,IF(cal!$S$7=2,EN!D15,IF(cal!$S$7=3,DE!D15,IF(cal!$S$7=4,FR!D15,IF(cal!$S$7=5,NR!D15,IF(cal!$S$7=6,SP!D15,IF(cal!$S$7=7,SW!D15,IF(cal!$S$7=8,TS!D15,IF(cal!$S$7=9,RU!D15,IF(cal!$S$7=10,ExtraTaal2!D15,IF(cal!$S$7=11,ExtraTaal3!D15,)))))))))))","v":"Мощность отпление 95/70/20 [W]"},{"$f":"IF($S$7=1,NL!E15,IF(cal!$S$7=2,EN!E15,IF(cal!$S$7=3,DE!E15,IF(cal!$S$7=4,FR!E15,IF(cal!$S$7=5,NR!E15,IF(cal!$S$7=6,SP!E15,IF(cal!$S$7=7,SW!E15,IF(cal!$S$7=8,TS!E15,IF(cal!$S$7=9,RU!E15,IF(cal!$S$7=10,ExtraTaal2!E15,IF(cal!$S$7=11,ExtraTaal3!E15,)))))))))))","v":"Расход теплоносителя, отопление [l/h]"},{"$f":"IF($S$7=1,NL!F15,IF(cal!$S$7=2,EN!F15,IF(cal!$S$7=3,DE!F15,IF(cal!$S$7=4,FR!F15,IF(cal!$S$7=5,NR!F15,IF(cal!$S$7=6,SP!F15,IF(cal!$S$7=7,SW!F15,IF(cal!$S$7=8,TS!F15,IF(cal!$S$7=9,RU!F15,IF(cal!$S$7=10,ExtraTaal2!F15,IF(cal!$S$7=11,ExtraTaal3!F15,)))))))))))","v":"Потери давления жидкости [kPa]"},{"$f":"IF($S$7=1,NL!G15,IF(cal!$S$7=2,EN!G15,IF(cal!$S$7=3,DE!G15,IF(cal!$S$7=4,FR!G15,IF(cal!$S$7=5,NR!G15,IF(cal!$S$7=6,SP!G15,IF(cal!$S$7=7,SW!G15,IF(cal!$S$7=8,TS!G15,IF(cal!$S$7=9,RU!G15,IF(cal!$S$7=10,ExtraTaal2!G15,IF(cal!$S$7=11,ExtraTaal3!G15,)))))))))))","v":"Ощущ. мощность, охлаждение 7/12/20 [W]"},{"$f":"IF($S$7=1,NL!H15,IF(cal!$S$7=2,EN!H15,IF(cal!$S$7=3,DE!H15,IF(cal!$S$7=4,FR!H15,IF(cal!$S$7=5,NR!H15,IF(cal!$S$7=6,SP!H15,IF(cal!$S$7=7,SW!H15,IF(cal!$S$7=8,TS!H15,IF(cal!$S$7=9,RU!H15,IF(cal!$S$7=10,ExtraTaal2!H15,IF(cal!$S$7=11,ExtraTaal3!H15,)))))))))))","v":"Общая мощность , охлаждение 7/12/20 [W]"},{"$f":"IF($S$7=1,NL!I15,IF(cal!$S$7=2,EN!I15,IF(cal!$S$7=3,DE!I15,IF(cal!$S$7=4,FR!I15,IF(cal!$S$7=5,NR!I15,IF(cal!$S$7=6,SP!I15,IF(cal!$S$7=7,SW!I15,IF(cal!$S$7=8,TS!I15,IF(cal!$S$7=9,RU!I15,IF(cal!$S$7=10,ExtraTaal2!I15,IF(cal!$S$7=11,ExtraTaal3!I15,)))))))))))","v":"Расход теплоносителя, охлаждение [l/h]"},{"$f":"IF($S$7=1,NL!J15,IF(cal!$S$7=2,EN!J15,IF(cal!$S$7=3,DE!J15,IF(cal!$S$7=4,FR!J15,IF(cal!$S$7=5,NR!J15,IF(cal!$S$7=6,SP!J15,IF(cal!$S$7=7,SW!J15,IF(cal!$S$7=8,TS!J15,IF(cal!$S$7=9,RU!J15,IF(cal!$S$7=10,ExtraTaal2!J15,IF(cal!$S$7=11,ExtraTaal3!J15,)))))))))))","v":"Потери давления жидкости [kPa]"},{"$f":"IF($S$7=1,NL!K15,IF(cal!$S$7=2,EN!K15,IF(cal!$S$7=3,DE!K15,IF(cal!$S$7=4,FR!K15,IF(cal!$S$7=5,NR!K15,IF(cal!$S$7=6,SP!K15,IF(cal!$S$7=7,SW!K15,IF(cal!$S$7=8,TS!K15,IF(cal!$S$7=9,RU!K15,IF(cal!$S$7=10,ExtraTaal2!K15,IF(cal!$S$7=11,ExtraTaal3!K15,)))))))))))","v":"Звуковое давление ** [dB(A)]"},{"$f":"IF($S$7=1,NL!L15,IF(cal!$S$7=2,EN!L15,IF(cal!$S$7=3,DE!L15,IF(cal!$S$7=4,FR!L15,IF(cal!$S$7=5,NR!L15,IF(cal!$S$7=6,SP!L15,IF(cal!$S$7=7,SW!L15,IF(cal!$S$7=8,TS!L15,IF(cal!$S$7=9,RU!L15,IF(cal!$S$7=10,ExtraTaal2!L15,IF(cal!$S$7=11,ExtraTaal3!L15,)))))))))))","v":"Звуковая мощность * [dB(A)]"},{"$f":"IF($S$7=1,NL!M15,IF(cal!$S$7=2,EN!M15,IF(cal!$S$7=3,DE!M15,IF(cal!$S$7=4,FR!M15,IF(cal!$S$7=5,NR!M15,IF(cal!$S$7=6,SP!M15,IF(cal!$S$7=7,SW!M15,IF(cal!$S$7=8,TS!M15,IF(cal!$S$7=9,RU!M15,IF(cal!$S$7=10,ExtraTaal2!M15,IF(cal!$S$7=11,ExtraTaal3!M15,)))))))))))","v":"Потребляемая мощность [W]"},{"$f":"IF($S$7=1,NL!N15,IF(cal!$S$7=2,EN!N15,IF(cal!$S$7=3,DE!N15,IF(cal!$S$7=4,FR!N15,IF(cal!$S$7=5,NR!N15,IF(cal!$S$7=6,SP!N15,IF(cal!$S$7=7,SW!N15,IF(cal!$S$7=8,TS!N15,IF(cal!$S$7=9,RU!N15,IF(cal!$S$7=10,ExtraTaal2!N15,IF(cal!$S$7=11,ExtraTaal3!N15,)))))))))))","v":"Расход воздуха [m³/h]"},{"$f":"IF($S$7=1,NL!O15,IF(cal!$S$7=2,EN!O15,IF(cal!$S$7=3,DE!O15,IF(cal!$S$7=4,FR!O15,IF(cal!$S$7=5,NR!O15,IF(cal!$S$7=6,SP!O15,IF(cal!$S$7=7,SW!O15,IF(cal!$S$7=8,TS!O15,IF(cal!$S$7=9,RU!O15,IF(cal!$S$7=10,ExtraTaal2!O15,IF(cal!$S$7=11,ExtraTaal3!O15,)))))))))))","v":"Темп. воздуха на выходе. отопление  [°C]"},{"$f":"IF($S$7=1,NL!P15,IF(cal!$S$7=2,EN!P15,IF(cal!$S$7=3,DE!P15,IF(cal!$S$7=4,FR!P15,IF(cal!$S$7=5,NR!P15,IF(cal!$S$7=6,SP!P15,IF(cal!$S$7=7,SW!P15,IF(cal!$S$7=8,TS!P15,IF(cal!$S$7=9,RU!P15,IF(cal!$S$7=10,ExtraTaal2!P15,IF(cal!$S$7=11,ExtraTaal3!P15,)))))))))))","v":"Темп.воздуха на выходе. охлаждение  [°C]"},{"$nulls":6},"Q_verw","KV","Q_voelb_c","dP_cool","Geluid_P","P_elek","V_air",null,"Q_verw","KV","Q_voelb_c","kV","Geluid_P","P_elek","V_air","Q_verw","KV","Q_voelb_c","KV","Geluid_P","P_elek","V_air","Q_verw","KV","Q_voelb_c","KV","Geluid_P","P_elek","V_air","Q_verw","KV","Q_voelb_c","KV","Geluid_P","P_elek","V_air","Q_verw","dP_verw","Q_voelb_c","dP_cool","Geluid_P","P_elek","V_air","Q_verw","dP_verw","Q_voelb_c","dP_cool","Geluid_P","P_elek","V_air","Q_verw","dP_verw","Q_voelb_c","dP_cool","Geluid_P","P_elek","V_air","Q_verw","dP_verw","Q_voelb_c","dP_cool","Geluid_P","P_elek","V_air"]
[null,{"$f":"IF($S$7=1,NL!B16,IF(cal!$S$7=2,EN!B16,IF(cal!$S$7=3,DE!B16,IF(cal!$S$7=4,FR!B16,IF(cal!$S$7=5,NR!B16,IF(cal!$S$7=6,SP!B16,IF(cal!$S$7=7,SW!B16,IF(cal!$S$7=8,TS!B16,IF(cal!$S$7=9,RU!B16,IF(cal!$S$7=10,ExtraTaal2!B16,IF(cal!$S$7=11,ExtraTaal3!B16,)))))))))))","v":"Briza Net Zero M H42 2P Высота 42 cm Ширина 14 cm Длина 75 cm (Тип 1)"},{"$nulls":16},"n-value",{"$nulls":3},{"$f":"IF('Briza Net Zero'!$K$4=cal!$X2,1,IF('Briza Net Zero'!$K$4=cal!$X3,2,IF('Briza Net Zero'!$K$4=cal!$X4,3,IF('Briza Net Zero'!$K$4=cal!$X5,4,IF('Briza Net Zero'!$K$4=cal!$X6,5,IF('Briza Net Zero'!$K$4=cal!$X7,6,IF('Briza Net Zero'!$K$4=cal!$X8,7,IF('Briza Net Zero'!$K$4=cal!$X9,8,))))))))","v":3},{"$nulls":7},"Briza Net Zero XS",{"$nulls":6},"Briza Net Zero S",{"$nulls":6},"Briza Net Zero M H41 2P",{"$nulls":6},"Briza Net Zero M H41 4P",{"$nulls":6},"Briza Net Zero M H55 2P",{"$nulls":6},"Briza Net Zero M H55 4P",{"$nulls":6},"unused",{"$nulls":6},"unused"]
[null,{"v":0.2,"d":"20%"},2,{"$f":"(($W$17*$C17^4+$W$18*$C17^3+$W$19*$C17^2+$W$20*$C17+$W$21)*((((Tv_heat-Tr_heat)/LN((Tv_heat-Tl_heat)/(Tr_heat-Tl_heat)))/((75-65)/LN((75-20)/(65-20))))^$S17))*$D$14*$AA$11","v":{"v":1116.8149275288226,"d":"1117"}},{"$f":"ROUND(((D17/$D$14)/((Tv_heat-Tr_heat)*1.163))*$E$14,IF($W$4=1,0,IF($W$4=2,2)))","v":38},{"$f":"IF($AA$1=1,IF((POWER(((E17/$I$14)/1000)/$X$18,2)*100)*$J$14<0.01,0.01,(POWER(((E17/$I$14)/1000)/$X$18,2)*100)*$J$14),($X$18*(E17/$E$14)^$X$20)*$F$14)","v":{"v":0.049493533406665124,"d":"0.05"}},{"$f":"(($Y$17*$C17^4+$Y$18*$C17^3+$Y$19*$C17^2+$Y$20*$C17+$Y$21)*((((Tv_cool-Tr_cool)/LN((Tv_cool-Tl_cool)/(Tr_cool-Tl_cool)))/((16-18)/LN((16-27)/(18-27))))^S17))*$G$14*$AA$11","v":{"v":119.20881976373083,"d":"119"}},{"$f":"((G17/$G$14)/(IF((237.3*LN((RH*EXP(17.27*(Tl_cool/(Tl_cool+237.3))))))/(17.27-LN((RH*EXP(17.27*(Tl_cool/(Tl_cool+237.3))))))<((Tv_cool+Tr_cool)/2),1,IF(1/(1+((2258*((0.622/((p_atm/(1*611*EXP(17.27*(((Tv_cool+Tr_cool)/2)/(((Tv_cool+Tr_cool)/2)+237.3))))))-1)*1000-(0.622/((p_atm/(RH*611*EXP(17.27*(Tl_cool/(Tl_cool+237.3))))))-1)*1000))/(1005*(((Tv_cool+Tr_cool)/2)-Tl_cool))))*1.039+((-0.000729*$C17+0.001448)*(Tl_cool-((Tv_cool+Tr_cool)/2))+(0.016908*$C17-0.033574))*1.039>1,1,1/(1+((2258*((0.622/((p_atm/(1*611*EXP(17.27*(((Tv_cool+Tr_cool)/2)/(((Tv_cool+Tr_cool)/2)+237.3))))))-1)*1000-(0.622/((p_atm/(RH*611*EXP(17.27*(Tl_cool/(Tl_cool+237.3))))))-1)*1000))/(1005*(((Tv_cool+Tr_cool)/2)-Tl_cool))))*1.039+((-0.000729*$C17+0.001448)*(Tl_cool-((Tv_cool+Tr_cool)/2))+(0.016908*$C17-0.033574))*1.039))))*$H$14","v":{"v":119.20881976373083,"d":"119"}},{"$f":"ROUND(((H17/$H$14)/((Tr_cool-Tv_cool)*1.163))*$I$14,IF($W$4=1,0,IF($W$4=2,2)))","v":21},{"$f":"IF($AA$1=1,IF((POWER(((I17/$I$14)/1000)/$X$18,2)*100)*$J$14<0.01,0.01,(POWER(((I17/$I$14)/1000)/$X$18,2)*100)*$J$14),($Z$18*(I17/$I$14)^$Z$20)*$J$14)","v":{"v":0.01666107031282953,"d":"0.02"}},{"$f":"IF(AA17<28,\"<20\",L17-8)","v":"<20"},{"$f":"IF(AA17<20,\"<20\",AA17)","v":26.5},{"$f":"AB17","v":1.6},{"$f":"AC17*$N$14","v":64},{"$f":"(Tl_heat+(($D17/$G$14)/(1006*$N17*$K$14)))*$M$14+$O$14","v":{"v":71.8655836356416,"d":"71.9"}},{"$f":"(Tl_cool-(($G17/$G$14)/(1006*$N17*$K$14)))*$M$14+$O$14","v":{"v":14.463867862831428,"d":"14.5"}},null,null,{"v":1,"d":"1.000"},{"$nulls":3},{"$f":"IF($W$16=1,AE17,IF($W$16=2,AL17,IF($W$16=3,AS17,IF($W$16=4,AZ17,IF($W$16=5,BG17,IF($W$16=6,BN17,IF($W$16=7,BU17,IF($W$16=8,CB17))))))))","v":0.007426362651946308},{"$f":"IF($W$16=1,AF17,IF($W$16=2,AM17,IF($W$16=3,AT17,IF($W$16=4,BA17,IF($W$16=5,BH17,IF($W$16=6,BO17,IF($W$16=7,BV17,IF($W$16=8,CC17))))))))","v":"a"},{"$f":"IF($W$16=1,AG17,IF($W$16=2,AN17,IF($W$16=3,AU17,IF($W$16=4,BB17,IF($W$16=5,BI17,IF($W$16=6,BP17,IF($W$16=7,BW17,IF($W$16=8,CD17))))))))","v":0},{"$f":"IF($W$16=1,AH17,IF($W$16=2,AO17,IF($W$16=3,AV17,IF($W$16=4,BC17,IF($W$16=5,BJ17,IF($W$16=6,BQ17,IF($W$16=7,BX17,IF($W$16=8,CE17))))))))","v":"a"},{"$f":"IF($W$16=1,AI17,IF($W$16=2,AP17,IF($W$16=3,AW17,IF($W$16=4,BD17,IF($W$16=5,BK17,IF($W$16=6,BR17,IF($W$16=7,BY17,IF($W$16=8,CF17))))))))","v":26.5},{"$f":"IF($W$16=1,AJ17,IF($W$16=2,AQ17,IF($W$16=3,AX17,IF($W$16=4,BE17,IF($W$16=5,BL17,IF($W$16=6,BS17,IF($W$16=7,BZ17,IF($W$16=8,CG17))))))))","v":1.6},{"$f":"IF($W$16=1,AK17,IF($W$16=2,AR17,IF($W$16=3,AY17,IF($W$16=4,BF17,IF($W$16=5,BM17,IF($W$16=6,BT17,IF($W$16=7,CA17,IF($W$16=8,CH17))))))))","v":64},"c",0,"a",null,"a",{"v":11,"d":"11.0"},{"v":0.5,"d":"0.500"},25,2.8199751689787116E-4,"a",-3.0601293465752058E-4,"a",{"v":25,"d":"25.0"},{"v":1,"d":"1.0"},32,0.007426362651946308,"a",null,"a",26.5,1.6,64,-0.30147360997762745,"a",null,"a",26.5,1.8,29,null,"a",-1.0144326001132824E-3,"a",27.2,{"v":2,"d":"2.0"},81,-0.24292209682737784,"a",null,"a",27.2,1.6,27]
[null,{"v":0.4,"d":"40%"},4,{"$f":"(($W$17*$C18^4+$W$18*$C18^3+$W$19*$C18^2+$W$20*$C18+$W$21)*((((Tv_heat-Tr_heat)/LN((Tv_heat-Tl_heat)/(Tr_heat-Tl_heat)))/((75-65)/LN((75-20)/(65-20))))^1))*$D$14*$AA$11","v":{"v":1280.044083187076,"d":"1280"}},{"$f":"ROUND(((D18/$D$14)/((Tv_heat-Tr_heat)*1.163))*$E$14,IF($W$4=1,0,IF($W$4=2,2)))","v":44},{"$f":"IF($AA$1=1,IF((POWER(((E18/$I$14)/1000)/$X$18,2)*100)*$J$14<0.01,0.01,(POWER(((E18/$I$14)/1000)/$X$18,2)*100)*$J$14),($X$18*(E18/$E$14)^$X$20)*$F$14)","v":{"v":0.06477902179486981,"d":"0.06"}},{"$f":"(($Y$17*$C18^4+$Y$18*$C18^3+$Y$19*$C18^2+$Y$20*$C18+$Y$21)*((((Tv_cool-Tr_cool)/LN((Tv_cool-Tl_cool)/(Tr_cool-Tl_cool)))/((16-18)/LN((16-27)/(18-27))))^S18))*$G$14*$AA$11","v":{"v":139.14180443920728,"d":"139"}},{"$f":"((G18/$G$14)/(IF((237.3*LN((RH*EXP(17.27*(Tl_cool/(Tl_cool+237.3))))))/(17.27-LN((RH*EXP(17.27*(Tl_cool/(Tl_cool+237.3))))))<((Tv_cool+Tr_cool)/2),1,IF(1/(1+((2258*((0.622/((p_atm/(1*611*EXP(17.27*(((Tv_cool+Tr_cool)/2)/(((Tv_cool+Tr_cool)/2)+237.3))))))-1)*1000-(0.622/((p_atm/(RH*611*EXP(17.27*(Tl_cool/(Tl_cool+237.3))))))-1)*1000))/(1005*(((Tv_cool+Tr_cool)/2)-Tl_cool))))*1.039+((-0.000729*$C18+0.001448)*(Tl_cool-((Tv_cool+Tr_cool)/2))+(0.016908*$C18-0.033574))*1.039>1,1,1/(1+((2258*((0.622/((p_atm/(1*611*EXP(17.27*(((Tv_cool+Tr_cool)/2)/(((Tv_cool+Tr_cool)/2)+237.3))))))-1)*1000-(0.622/((p_atm/(RH*611*EXP(17.27*(Tl_cool/(Tl_cool+237.3))))))-1)*1000))/(1005*(((Tv_cool+Tr_cool)/2)-Tl_cool))))*1.039+((-0.000729*$C18+0.001448)*(Tl_cool-((Tv_cool+Tr_cool)/2))+(0.016908*$C18-0.033574))*1.039))))*$H$14","v":{"v":139.14180443920728,"d":"139"}},{"$f":"ROUND(((H18/$H$14)/((Tr_cool-Tv_cool)*1.163))*$I$14,IF($W$4=1,0,IF($W$4=2,2)))","v":24},{"$f":"IF($AA$1=1,IF((POWER(((I18/$I$14)/1000)/$X$18,2)*100)*$J$14<0.01,0.01,(POWER(((I18/$I$14)/1000)/$X$18,2)*100)*$J$14),($Z$18*(I18/$I$14)^$Z$20)*$J$14)","v":{"v":0.021289553035389902,"d":"0.02"}},{"$f":"IF(AA18<28,\"<20\",L18-8)","v":29.4},{"$f":"IF(AA18<20,\"<20\",AA18)","v":37.4},{"$f":"AB18","v":2.6},{"$f":"AC18*$N$14","v":101},{"$f":"(Tl_heat+(($D18/$G$14)/(1006*$N18*$K$14)))*$M$14+$O$14","v":{"v":57.66878270093167,"d":"57.7"}},{"$f":"(Tl_cool-(($G18/$G$14)/(1006*$N18*$K$14)))*$M$14+$O$14","v":{"v":15.905373521991413,"d":"15.9"}},null,null,{"v":1,"d":"1.000"},{"$nulls":3},{"$f":"IF($W$16=1,AE18,IF($W$16=2,AL18,IF($W$16=3,AS18,IF($W$16=4,AZ18,IF($W$16=5,BG18,IF($W$16=6,BN18,IF($W$16=7,BU18,IF($W$16=8,CB18))))))))","v":0.2117387680171521},{"$f":"IF($W$16=1,AF18,IF($W$16=2,AM18,IF($W$16=3,AT18,IF($W$16=4,BA18,IF($W$16=5,BH18,IF($W$16=6,BO18,IF($W$16=7,BV18,IF($W$16=8,CC18))))))))","v":6.2276819636539519E-5},{"$f":"IF($W$16=1,AG18,IF($W$16=2,AN18,IF($W$16=3,AU18,IF($W$16=4,BB18,IF($W$16=5,BI18,IF($W$16=6,BP18,IF($W$16=7,BW18,IF($W$16=8,CD18))))))))","v":-0.030099755140858282},{"$f":"IF($W$16=1,AH18,IF($W$16=2,AO18,IF($W$16=3,AV18,IF($W$16=4,BC18,IF($W$16=5,BJ18,IF($W$16=6,BQ18,IF($W$16=7,BX18,IF($W$16=8,CE18))))))))","v":6.2276819636539519E-5},37.4,2.6,101,"d",0,1.903,null,{"$f":"AF18","v":1.903},{"v":21,"d":"21.0"},{"v":0.8,"d":"0.800"},34,-0.011828263872689105,1.45864991497895,-8.5029112474804521E-4,1.45864991497895,31.5,1.4,63,0.2117387680171521,6.2276819636539519E-5,-0.030099755140858282,6.2276819636539519E-5,37.4,2.6,101,8.050935653010697,6.2276819636539519E-5,null,6.2276819636539519E-5,37.4,{"v":3,"d":"3.0"},61,null,1.3263547865279744E-4,-2.0070321215289355E-3,1.3263547865279744E-4,33.2,3.2,118,6.228804439978892,6.2276819636539519E-5,-0.10047556370896396,1.3263547865279744E-4,33.2,2.2,67]
[null,{"v":0.6,"d":"60%"},6,{"$f":"(($W$17*$C19^4+$W$18*$C19^3+$W$19*$C19^2+$W$20*$C19+$W$21)*((((Tv_heat-Tr_heat)/LN((Tv_heat-Tl_heat)/(Tr_heat-Tl_heat)))/((75-65)/LN((75-20)/(65-20))))^1))*$D$14*$AA$11","v":{"v":1477.7034719623746,"d":"1478"}},{"$f":"ROUND(((D19/$D$14)/((Tv_heat-Tr_heat)*1.163))*$E$14,IF($W$4=1,0,IF($W$4=2,2)))","v":51},{"v":0.08494611790310158,"d":"0.08"},{"$f":"(($Y$17*$C19^4+$Y$18*$C19^3+$Y$19*$C19^2+$Y$20*$C19+$Y$21)*((((Tv_cool-Tr_cool)/LN((Tv_cool-Tl_cool)/(Tr_cool-Tl_cool)))/((16-18)/LN((16-27)/(18-27))))^S19))*$G$14*$AA$11","v":{"v":163.78139160055466,"d":"164"}},{"$f":"((G19/$G$14)/(IF((237.3*LN((RH*EXP(17.27*(Tl_cool/(Tl_cool+237.3))))))/(17.27-LN((RH*EXP(17.27*(Tl_cool/(Tl_cool+237.3))))))<((Tv_cool+Tr_cool)/2),1,IF(1/(1+((2258*((0.622/((p_atm/(1*611*EXP(17.27*(((Tv_cool+Tr_cool)/2)/(((Tv_cool+Tr_cool)/2)+237.3))))))-1)*1000-(0.622/((p_atm/(RH*611*EXP(17.27*(Tl_cool/(Tl_cool+237.3))))))-1)*1000))/(1005*(((Tv_cool+Tr_cool)/2)-Tl_cool))))*1.039+((-0.000729*$C19+0.001448)*(Tl_cool-((Tv_cool+Tr_cool)/2))+(0.016908*$C19-0.033574))*1.039>1,1,1/(1+((2258*((0.622/((p_atm/(1*611*EXP(17.27*(((Tv_cool+Tr_cool)/2)/(((Tv_cool+Tr_cool)/2)+237.3))))))-1)*1000-(0.622/((p_atm/(RH*611*EXP(17.27*(Tl_cool/(Tl_cool+237.3))))))-1)*1000))/(1005*(((Tv_cool+Tr_cool)/2)-Tl_cool))))*1.039+((-0.000729*$C19+0.001448)*(Tl_cool-((Tv_cool+Tr_cool)/2))+(0.016908*$C19-0.033574))*1.039))))*$H$14","v":{"v":163.78139160055466,"d":"164"}},{"$f":"ROUND(((H19/$H$14)/((Tr_cool-Tv_cool)*1.163))*$I$14,IF($W$4=1,0,IF($W$4=2,2)))","v":28},{"v":0.02825334052634823,"d":"0.03"},{"v":31.299999999999997,"d":"31.3"},39.3,4.3,141,{"$f":"(Tl_heat+(($D19/$G$14)/(1006*$N19*$K$14)))*$M$14+$O$14","v":{"v":51.14915101099861,"d":"51.1"}},{"$f":"(Tl_cool-(($G19/$G$14)/(1006*$N19*$K$14)))*$M$14+$O$14","v":{"v":16.547581164587616,"d":"16.5"}},null,null,{"v":1,"d":"1.000"},{"$nulls":3},0.194898331995627,"b",0.9305607865244807,"b",39.3,4.3,141,"e",0.0938,"b",{"v":-0.8593,"d":"-0.9"},"b",30.5,{"v":1.3,"d":"1.300"},47,-10.176345337508607,"b",-2.956590447494051,"b",36.5,2.4,95,0.194898331995627,"b",0.9305607865244807,"b",39.3,4.3,141,-70.67484160702348,"b",0.21600510650865656,"b",39.3,4.8,86,-0.3566357515748594,"b",-0.0721164737460312,"b",40.2,5.5,154,-50.901906972048394,"b",1.8516402222660224,"b",40.2,3.6,107]
[null,{"v":0.8,"d":"80%"},8,{"$f":"(($W$17*$C20^4+$W$18*$C20^3+$W$19*$C20^2+$W$20*$C20+$W$21)*((((Tv_heat-Tr_heat)/LN((Tv_heat-Tl_heat)/(Tr_heat-Tl_heat)))/((75-65)/LN((75-20)/(65-20))))^1))*$D$14*$AA$11","v":{"v":1731.189213486523,"d":"1731"}},{"$f":"ROUND(((D20/$D$14)/((Tv_heat-Tr_heat)*1.163))*$E$14,IF($W$4=1,0,IF($W$4=2,2)))","v":60},{"v":0.11447713273267565,"d":"0.11"},{"$f":"(($Y$17*$C20^4+$Y$18*$C20^3+$Y$19*$C20^2+$Y$20*$C20+$Y$21)*((((Tv_cool-Tr_cool)/LN((Tv_cool-Tl_cool)/(Tr_cool-Tl_cool)))/((16-18)/LN((16-27)/(18-27))))^S20))*$G$14*$AA$11","v":{"v":191.6346770511314,"d":"192"}},{"$f":"((G20/$G$14)/(IF((237.3*LN((RH*EXP(17.27*(Tl_cool/(Tl_cool+237.3))))))/(17.27-LN((RH*EXP(17.27*(Tl_cool/(Tl_cool+237.3))))))<((Tv_cool+Tr_cool)/2),1,IF(1/(1+((2258*((0.622/((p_atm/(1*611*EXP(17.27*(((Tv_cool+Tr_cool)/2)/(((Tv_cool+Tr_cool)/2)+237.3))))))-1)*1000-(0.622/((p_atm/(RH*611*EXP(17.27*(Tl_cool/(Tl_cool+237.3))))))-1)*1000))/(1005*(((Tv_cool+Tr_cool)/2)-Tl_cool))))*1.039+((-0.000729*$C20+0.001448)*(Tl_cool-((Tv_cool+Tr_cool)/2))+(0.016908*$C20-0.033574))*1.039>1,1,1/(1+((2258*((0.622/((p_atm/(1*611*EXP(17.27*(((Tv_cool+Tr_cool)/2)/(((Tv_cool+Tr_cool)/2)+237.3))))))-1)*1000-(0.622/((p_atm/(RH*611*EXP(17.27*(Tl_cool/(Tl_cool+237.3))))))-1)*1000))/(1005*(((Tv_cool+Tr_cool)/2)-Tl_cool))))*1.039+((-0.000729*$C20+0.001448)*(Tl_cool-((Tv_cool+Tr_cool)/2))+(0.016908*$C20-0.033574))*1.039))))*$H$14","v":{"v":191.6346770511314,"d":"192"}},{"$f":"ROUND(((H20/$H$14)/((Tr_cool-Tv_cool)*1.163))*$I$14,IF($W$4=1,0,IF($W$4=2,2)))","v":33},{"v":0.038200362039105804,"d":"0.04"},37.3,45.3,7.2,178,{"$f":"(Tl_heat+(($D20/$G$14)/(1006*$N20*$K$14)))*$M$14+$O$14","v":{"v":48.90696977079389,"d":"48.9"}},{"$f":"(Tl_cool-(($G20/$G$14)/(1006*$N20*$K$14)))*$M$14+$O$14","v":{"v":16.80013150879303,"d":"16.8"}},null,null,{"v":1,"d":"1.000"},{"$nulls":3},57.97328440504217,1.8358350093844202,4.904703066929431,1.8358350093844202,45.3,7.2,178,"f",77.5,null,{"v":25.375,"d":"25.4"},{"$f":"AF20","v":0},{"v":37,"d":"37.0"},{"v":2.1,"d":"2.100"},61,340.28151023795266,{"$f":"AF20","v":0},79.52374881884938,2,{"v":43,"d":"43.0"},3.8,123,57.97328440504217,1.8358350093844202,4.904703066929431,1.8358350093844202,45.3,7.2,178,305.78049129814406,1.8358350093844202,7.20633401395817,1.8358350093844202,45.3,{"v":8,"d":"8.0"},116,152.87981581044934,1.8136893271096062,22.687985802451447,1.8136893271096062,46.1,9.6,193,203.12988403023203,1.8358350093844202,4.151420157600327,1.8136893271096062,46.1,6.3,137]
[null,{"v":1,"d":"100%"},10,{"$f":"(($W$17*$C21^4+$W$18*$C21^3+$W$19*$C21^2+$W$20*$C21+$W$21)*((((Tv_heat-Tr_heat)/LN((Tv_heat-Tl_heat)/(Tr_heat-Tl_heat)))/((75-65)/LN((75-20)/(65-20))))^1))*$D$14*$AA$11","v":{"v":2065.4258277275967,"d":"2065"}},{"$f":"ROUND(((D21/$D$14)/((Tv_heat-Tr_heat)*1.163))*$E$14,IF($W$4=1,0,IF($W$4=2,2)))","v":71},{"v":0.1559305870132709,"d":"0.16"},{"$f":"(($Y$17*$C21^4+$Y$18*$C21^3+$Y$19*$C21^2+$Y$20*$C21+$Y$21)*((((Tv_cool-Tr_cool)/LN((Tv_cool-Tl_cool)/(Tr_cool-Tl_cool)))/((16-18)/LN((16-27)/(18-27))))^S21))*$G$14*$AA$11","v":{"v":221.208756594296,"d":"221"}},{"$f":"((G21/$G$14)/(IF((237.3*LN((RH*EXP(17.27*(Tl_cool/(Tl_cool+237.3))))))/(17.27-LN((RH*EXP(17.27*(Tl_cool/(Tl_cool+237.3))))))<((Tv_cool+Tr_cool)/2),1,IF(1/(1+((2258*((0.622/((p_atm/(1*611*EXP(17.27*(((Tv_cool+Tr_cool)/2)/(((Tv_cool+Tr_cool)/2)+237.3))))))-1)*1000-(0.622/((p_atm/(RH*611*EXP(17.27*(Tl_cool/(Tl_cool+237.3))))))-1)*1000))/(1005*(((Tv_cool+Tr_cool)/2)-Tl_cool))))*1.039+((-0.000729*$C21+0.001448)*(Tl_cool-((Tv_cool+Tr_cool)/2))+(0.016908*$C21-0.033574))*1.039>1,1,1/(1+((2258*((0.622/((p_atm/(1*611*EXP(17.27*(((Tv_cool+Tr_cool)/2)/(((Tv_cool+Tr_cool)/2)+237.3))))))-1)*1000-(0.622/((p_atm/(RH*611*EXP(17.27*(Tl_cool/(Tl_cool+237.3))))))-1)*1000))/(1005*(((Tv_cool+Tr_cool)/2)-Tl_cool))))*1.039+((-0.000729*$C21+0.001448)*(Tl_cool-((Tv_cool+Tr_cool)/2))+(0.016908*$C21-0.033574))*1.039))))*$H$14","v":{"v":221.208756594296,"d":"221"}},{"$f":"ROUND(((H21/$H$14)/((Tr_cool-Tv_cool)*1.163))*$I$14,IF($W$4=1,0,IF($W$4=2,2)))","v":38},{"v":0.049493533406665124,"d":"0.05"},42.5,50.5,{"v":13,"d":"13.0"},214,{"$f":"(Tl_heat+(($D21/$G$14)/(1006*$N21*$K$14)))*$M$14+$O$14","v":{"v":48.68625556801149,"d":"48.7"}},{"$f":"(Tl_cool-(($G21/$G$14)/(1006*$N21*$K$14)))*$M$14+$O$14","v":{"v":16.92767910599454,"d":"16.9"}},null,null,{"v":1,"d":"1.000"},{"$nulls":3},784.093120588767,0,102.07589640134984,0,50.5,13,214,"g",26.625,null,{"v":-29.312,"d":"-29.3"},null,43.5,{"v":3,"d":"3.000"},77,-445.70576074243365,null,-119.69074437130477,null,48.5,6.5,160,784.093120588767,null,102.07589640134984,null,50.5,{"v":13,"d":"13.0"},214,309.52771297860744,null,77.12870516216368,null,50.5,13.7,143,1095.212852006489,null,124.68763734693975,null,50.5,16.8,228,361.3522797245796,null,122.85501458041243,null,50.5,10.3,171]
[null,{"$f":"IF($S$7=1,NL!B22,IF(cal!$S$7=2,EN!B22,IF(cal!$S$7=3,DE!B22,IF(cal!$S$7=4,FR!B22,IF(cal!$S$7=5,NR!B22,IF(cal!$S$7=6,SP!B22,IF(cal!$S$7=7,SW!B22,IF(cal!$S$7=8,TS!B22,IF(cal!$S$7=9,RU!B22,IF(cal!$S$7=10,ExtraTaal2!B22,IF(cal!$S$7=11,ExtraTaal3!B22,)))))))))))","v":"Briza Net Zero M H42 2P Высота 42 cm Ширина 14 cm Длина 95 cm (Тип 2)"},{"$nulls":16},"n-value",{"$nulls":3},"H",{"$f":"IF($W$16=1,AF22,IF($W$16=2,AM22,IF($W$16=3,AT22,IF($W$16=4,BA22,IF($W$16=5,BH22,IF($W$16=6,BO22,IF($W$16=7,BV22,IF($W$16=8,CC22))))))))*IF($W$4=1,1,IF($W$4=2,1/2.54))","v":{"v":42,"d":"42.0"}},"B",{"$f":"IF($W$16=1,AH22,IF($W$16=2,AO22,IF($W$16=3,AV22,IF($W$16=4,BC22,IF($W$16=5,BJ22,IF($W$16=6,BQ22,IF($W$16=7,BX22,IF($W$16=8,CE22))))))))*IF($W$4=1,1,IF($W$4=2,1/2.54))","v":{"v":14,"d":"14.0"}},"L",{"$f":"IF($W$16=1,AJ22,IF($W$16=2,AQ22,IF($W$16=3,AX22,IF($W$16=4,BE22,IF($W$16=5,BL22,IF($W$16=6,BS22,IF($W$16=7,BZ22,IF($W$16=8,CG22))))))))*IF($W$4=1,1,IF($W$4=2,1/2.54))","v":{"v":75,"d":"75.0"}},null,null,"H",{"$f":"IF(AI1=AH2,AL4,AM4)","v":52.1},"B",{"$f":"IF(AI1=AH2,AL3,AM3)","v":8.5},"L",{"$f":"IF(AI1=AH2,AL5,AM5)","v":86},36,"H",{"$f":"IF(AI1=AH2,AN4,AO4)","v":55.8},"B",{"$f":"IF(AI1=AH2,AN3,AO3)","v":11},"L",{"$f":"IF(AI1=AH2,AN5,AO5)","v":75},null,"H",{"$f":"IF(AI1=AH2,AP4,AQ4)","v":42},"B",{"$f":"IF(AI1=AH2,AP3,AQ3)","v":14},"L",{"$f":"IF(AI1=AH2,AP5,AQ5)","v":75},null,"H",{"$f":"AT22","v":42},"B",{"$f":"AV22","v":14},"L",{"$f":"AX22","v":75},null,"H",{"$f":"IF(AI1=AH3,AR4,AS4)","v":56},"B",{"$f":"IF(AI1=AH2,AR3,AS3)","v":14},"L",{"$f":"IF(AI1=AH2,AR5,AS5)","v":75},null,"H",{"$f":"BH22","v":56},{"$f":"BI22","v":"B"},14,"L",75]
[null,{"v":0.2,"d":"20%"},2,{"$f":"(($W$23*$C23^4+$W$24*$C23^3+$W$25*$C23^2+$W$26*$C23+$W$27)*((((Tv_heat-Tr_heat)/LN((Tv_heat-Tl_heat)/(Tr_heat-Tl_heat)))/((75-65)/LN((75-20)/(65-20))))^1))*$D$14*$AA$11","v":{"v":1911.6796664330318,"d":"1912"}},{"$f":"ROUND(((D23/$D$14)/((Tv_heat-Tr_heat)*1.163))*$E$14,IF($W$4=1,0,IF($W$4=2,2)))","v":66},{"$f":"IF($AA$1=1,IF((POWER(((E23/$I$14)/1000)/$X$24,2)*100)*$J$14<0.01,0.01,(POWER(((E23/$I$14)/1000)/$X$24,2)*100)*$J$14),($X$24*(E23/$E$14)^$X$26)*$F$14)","v":{"v":0.1787021186706295,"d":"0.18"}},{"$f":"(($Y$23*$C23^4+$Y$24*$C23^3+$Y$25*$C23^2+$Y$26*$C23+$Y$27)*((((Tv_cool-Tr_cool)/LN((Tv_cool-Tl_cool)/(Tr_cool-Tl_cool)))/((16-18)/LN((16-27)/(18-27))))^S23))*$G$14*$AA$11","v":{"v":197.61910273066172,"d":"198"}},{"$f":"((G23/$G$14)/(IF((237.3*LN((RH*EXP(17.27*(Tl_cool/(Tl_cool+237.3))))))/(17.27-LN((RH*EXP(17.27*(Tl_cool/(Tl_cool+237.3))))))<((Tv_cool+Tr_cool)/2),1,IF(1/(1+((2258*((0.622/((p_atm/(1*611*EXP(17.27*(((Tv_cool+Tr_cool)/2)/(((Tv_cool+Tr_cool)/2)+237.3))))))-1)*1000-(0.622/((p_atm/(RH*611*EXP(17.27*(Tl_cool/(Tl_cool+237.3))))))-1)*1000))/(1005*(((Tv_cool+Tr_cool)/2)-Tl_cool))))*1.039+((-0.000729*$C23+0.001448)*(Tl_cool-((Tv_cool+Tr_cool)/2))+(0.016908*$C23-0.033574))*1.039>1,1,1/(1+((2258*((0.622/((p_atm/(1*611*EXP(17.27*(((Tv_cool+Tr_cool)/2)/(((Tv_cool+Tr_cool)/2)+237.3))))))-1)*1000-(0.622/((p_atm/(RH*611*EXP(17.27*(Tl_cool/(Tl_cool+237.3))))))-1)*1000))/(1005*(((Tv_cool+Tr_cool)/2)-Tl_cool))))*1.039+((-0.000729*$C23+0.001448)*(Tl_cool-((Tv_cool+Tr_cool)/2))+(0.016908*$C23-0.033574))*1.039))))*$H$14","v":{"v":197.61910273066172,"d":"198"}},{"$f":"ROUND(((H23/$H$14)/((Tr_cool-Tv_cool)*1.163))*$I$14,IF($W$4=1,0,IF($W$4=2,2)))","v":34},{"$f":"IF($AA$1=1,IF((POWER(((I23/$I$14)/1000)/$X$24,2)*100)*$J$14<0.01,0.01,(POWER(((I23/$I$14)/1000)/$X$24,2)*100)*$J$14),($Z$24*(I23/$I$14)^$Z$26)*$J$14)","v":{"v":0.053622434479017295,"d":"0.05"}},{"$f":"IF(AA23<28,\"<20\",L23-8)","v":{"v":24,"d":"24.0"}},{"$f":"IF(AA23<20,\"<20\",AA23)","v":{"v":32,"d":"32.0"}},{"$f":"AB23","v":2.5},{"$f":"AC23*$N$14","v":108},{"$f":"(Tl_heat+(($D23/$G$14)/(1006*$N23*$K$14)))*$M$14+$O$14","v":{"v":72.61013284724197,"d":"72.6"}},{"$f":"(Tl_cool-((G23/$G$14)/(1006*N23*$K$14)))*$M$14+$O$14","v":{"v":14.561449059500639,"d":"14.6"}},null,null,{"v":1,"d":"1.000"},{"$nulls":3},{"$f":"IF($W$16=1,AE23,IF($W$16=2,AL23,IF($W$16=3,AS23,IF($W$16=4,AZ23,IF($W$16=5,BG23,IF($W$16=6,BN23,IF($W$16=7,BU23,IF($W$16=8,CB23))))))))","v":-1.8027755792474383},{"$f":"IF($W$16=1,AF23,IF($W$16=2,AM23,IF($W$16=3,AT23,IF($W$16=4,BA23,IF($W$16=5,BH23,IF($W$16=6,BO23,IF($W$16=7,BV23,IF($W$16=8,CC23))))))))","v":"a"},{"$f":"IF($W$16=1,AG23,IF($W$16=2,AN23,IF($W$16=3,AU23,IF($W$16=4,BB23,IF($W$16=5,BI23,IF($W$16=6,BP23,IF($W$16=7,BW23,IF($W$16=8,CD23))))))))","v":0},{"$f":"IF($W$16=1,AH23,IF($W$16=2,AO23,IF($W$16=3,AV23,IF($W$16=4,BC23,IF($W$16=5,BJ23,IF($W$16=6,BQ23,IF($W$16=7,BX23,IF($W$16=8,CE23))))))))","v":"a"},{"$f":"IF($W$16=1,AI23,IF($W$16=2,AP23,IF($W$16=3,AW23,IF($W$16=4,BD23,IF($W$16=5,BK23,IF($W$16=6,BR23,IF($W$16=7,BY23,IF($W$16=8,CF23))))))))","v":32},{"$f":"IF($W$16=1,AJ23,IF($W$16=2,AQ23,IF($W$16=3,AX23,IF($W$16=4,BE23,IF($W$16=5,BL23,IF($W$16=6,BS23,IF($W$16=7,BZ23,IF($W$16=8,CG23))))))))","v":2.5},{"$f":"IF($W$16=1,AK23,IF($W$16=2,AR23,IF($W$16=3,AY23,IF($W$16=4,BF23,IF($W$16=5,BM23,IF($W$16=6,BT23,IF($W$16=7,CA23,IF($W$16=8,CH23))))))))","v":108},"c",0,"a",0,"a",{"v":15,"d":"15.0"},{"v":0.6,"d":"0.600"},26,-5.5671686104592712E-5,"a",-7.0467345058072893E-4,"a",{"v":30,"d":"30.0"},1.1,55,-1.8027755792474383,"a",null,"a",{"v":32,"d":"32.0"},2.5,108,null,"a",null,"a",{"v":32,"d":"32.0"},{"v":2,"d":"2.0"},52,null,"a",null,"a",{"v":31,"d":"31.0"},2.2,116,-0.18030344638520918,"a",null,"a",{"v":31,"d":"31.0"},2.1,72]
[null,{"v":0.4,"d":"40%"},4,{"$f":"(($W$23*$C24^4+$W$24*$C24^3+$W$25*$C24^2+$W$26*$C24+$W$27)*((((Tv_heat-Tr_heat)/LN((Tv_heat-Tl_heat)/(Tr_heat-Tl_heat)))/((75-65)/LN((75-20)/(65-20))))^1))*$D$14*$AA$11","v":{"v":2102.7077241964616,"d":"2103"}},{"$f":"ROUND(((D24/$D$14)/((Tv_heat-Tr_heat)*1.163))*$E$14,IF($W$4=1,0,IF($W$4=2,2)))","v":72},{"$f":"IF($AA$1=1,IF((POWER(((E24/$I$14)/1000)/$X$24,2)*100)*$J$14<0.01,0.01,(POWER(((E24/$I$14)/1000)/$X$24,2)*100)*$J$14), ($X$24*(E24/$E$14)^$X$26)*$F$14)","v":{"v":0.20927085385147567,"d":"0.21"}},{"$f":"(($Y$23*$C24^4+$Y$24*$C24^3+$Y$25*$C24^2+$Y$26*$C24+$Y$27)*((((Tv_cool-Tr_cool)/LN((Tv_cool-Tl_cool)/(Tr_cool-Tl_cool)))/((16-18)/LN((16-27)/(18-27))))^S24))*$G$14*$AA$11","v":{"v":224.5005084328207,"d":"225"}},{"$f":"((G24/$G$14)/(IF((237.3*LN((RH*EXP(17.27*(Tl_cool/(Tl_cool+237.3))))))/(17.27-LN((RH*EXP(17.27*(Tl_cool/(Tl_cool+237.3))))))<((Tv_cool+Tr_cool)/2),1,IF(1/(1+((2258*((0.622/((p_atm/(1*611*EXP(17.27*(((Tv_cool+Tr_cool)/2)/(((Tv_cool+Tr_cool)/2)+237.3))))))-1)*1000-(0.622/((p_atm/(RH*611*EXP(17.27*(Tl_cool/(Tl_cool+237.3))))))-1)*1000))/(1005*(((Tv_cool+Tr_cool)/2)-Tl_cool))))*1.039+((-0.000729*$C24+0.001448)*(Tl_cool-((Tv_cool+Tr_cool)/2))+(0.016908*$C24-0.033574))*1.039>1,1,1/(1+((2258*((0.622/((p_atm/(1*611*EXP(17.27*(((Tv_cool+Tr_cool)/2)/(((Tv_cool+Tr_cool)/2)+237.3))))))-1)*1000-(0.622/((p_atm/(RH*611*EXP(17.27*(Tl_cool/(Tl_cool+237.3))))))-1)*1000))/(1005*(((Tv_cool+Tr_cool)/2)-Tl_cool))))*1.039+((-0.000729*$C24+0.001448)*(Tl_cool-((Tv_cool+Tr_cool)/2))+(0.016908*$C24-0.033574))*1.039))))*$H$14","v":{"v":224.5005084328207,"d":"225"}},{"$f":"ROUND(((H24/$H$14)/((Tr_cool-Tv_cool)*1.163))*$I$14,IF($W$4=1,0,IF($W$4=2,2)))","v":39},{"$f":"IF($AA$1=1,IF((POWER(((I24/$I$14)/1000)/$X$24,2)*100)*$J$14<0.01,0.01,(POWER(((I24/$I$14)/1000)/$X$24,2)*100)*$J$14),($Z$24*(I24/$I$14)^$Z$26)*$J$14)","v":{"v":0.06878333233288801,"d":"0.07"}},{"$f":"IF(AA24<28,\"<20\",L24-8)","v":{"v":30,"d":"30.0"}},{"$f":"IF(AA24<20,\"<20\",AA24)","v":{"v":38,"d":"38.0"}},4.3,172,{"$f":"(Tl_heat+(($D24/$G$14)/(1006*$N24*$K$14)))*$M$14+$O$14","v":{"v":56.335278750444445,"d":"56.3"}},{"$f":"(Tl_cool-((G24/$G$14)/(1006*N24*$K$14)))*$M$14+$O$14","v":{"v":16.120578975549105,"d":"16.1"}},null,null,{"v":1,"d":"1.000"},{"$nulls":3},{"$f":"IF($W$16=1,AE24,IF($W$16=2,AL24,IF($W$16=3,AS24,IF($W$16=4,AZ24,IF($W$16=5,BG24,IF($W$16=6,BN24,IF($W$16=7,BU24,IF($W$16=8,CB24))))))))","v":44.485461171044086},8.9125876915269658E-5,{"$f":"IF($W$16=1,AG24,IF($W$16=2,AN24,IF($W$16=3,AU24,IF($W$16=4,BB24,IF($W$16=5,BI24,IF($W$16=6,BP24,IF($W$16=7,BW24,IF($W$16=8,CD24))))))))","v":0.01476638839062954},8.9125876915269658E-5,38,4.3,172,"d",0,1.7735440000000002,0,{"$f":"AF24","v":1.7735440000000002},{"v":24,"d":"24.0"},{"v":1.3,"d":"1.300"},56,6.7997560216527308E-5,1.2490245804211,0.007568222552112587,1.2490245804211,{"v":38,"d":"38.0"},1.9,100,44.485461171044086,8.9125876915269658E-5,0.01476638839062954,8.9125876915269658E-5,{"v":38,"d":"38.0"},4.3,172,0.9685779641783515,8.9125876915269658E-5,0.1360465769148562,8.9125876915269658E-5,{"v":38,"d":"38.0"},3.4,92,-0.36935046666650995,1.6747942882275273E-4,-0.14605906212444036,1.6747942882275273E-4,35.8,3.6,176,5.194823262565557,8.9125876915269658E-5,-0.10565020591365754,1.6747942882275273E-4,35.8,3.4,123]
[null,{"v":0.6,"d":"60%"},6,{"$f":"(($W$23*$C25^4+$W$24*$C25^3+$W$25*$C25^2+$W$26*$C25+$W$27)*((((Tv_heat-Tr_heat)/LN((Tv_heat-Tl_heat)/(Tr_heat-Tl_heat)))/((75-65)/LN((75-20)/(65-20))))^1))*$D$14*$AA$11","v":{"v":2223.6858727984295,"d":"2224"}},{"$f":"ROUND(((D25/$D$14)/((Tv_heat-Tr_heat)*1.163))*$E$14,IF($W$4=1,0,IF($W$4=2,2)))","v":76},{"v":0.2308460594536478,"d":"0.23"},{"$f":"(($Y$23*$C25^4+$Y$24*$C25^3+$Y$25*$C25^2+$Y$26*$C25+$Y$27)*((((Tv_cool-Tr_cool)/LN((Tv_cool-Tl_cool)/(Tr_cool-Tl_cool)))/((16-18)/LN((16-27)/(18-27))))^S25))*$G$14*$AA$11","v":{"v":260.72072762196944,"d":"261"}},{"$f":"((G25/$G$14)/(IF((237.3*LN((RH*EXP(17.27*(Tl_cool/(Tl_cool+237.3))))))/(17.27-LN((RH*EXP(17.27*(Tl_cool/(Tl_cool+237.3))))))<((Tv_cool+Tr_cool)/2),1,IF(1/(1+((2258*((0.622/((p_atm/(1*611*EXP(17.27*(((Tv_cool+Tr_cool)/2)/(((Tv_cool+Tr_cool)/2)+237.3))))))-1)*1000-(0.622/((p_atm/(RH*611*EXP(17.27*(Tl_cool/(Tl_cool+237.3))))))-1)*1000))/(1005*(((Tv_cool+Tr_cool)/2)-Tl_cool))))*1.039+((-0.000729*$C25+0.001448)*(Tl_cool-((Tv_cool+Tr_cool)/2))+(0.016908*$C25-0.033574))*1.039>1,1,1/(1+((2258*((0.622/((p_atm/(1*611*EXP(17.27*(((Tv_cool+Tr_cool)/2)/(((Tv_cool+Tr_cool)/2)+237.3))))))-1)*1000-(0.622/((p_atm/(RH*611*EXP(17.27*(Tl_cool/(Tl_cool+237.3))))))-1)*1000))/(1005*(((Tv_cool+Tr_cool)/2)-Tl_cool))))*1.039+((-0.000729*$C25+0.001448)*(Tl_cool-((Tv_cool+Tr_cool)/2))+(0.016908*$C25-0.033574))*1.039))))*$H$14","v":{"v":260.72072762196944,"d":"261"}},{"$f":"ROUND(((H25/$H$14)/((Tr_cool-Tv_cool)*1.163))*$I$14,IF($W$4=1,0,IF($W$4=2,2)))","v":45},{"v":0.08918048560215633,"d":"0.09"},36.8,44.8,7.2,223,{"$f":"(Tl_heat+(($D25/$G$14)/(1006*$N25*$K$14)))*$M$14+$O$14","v":{"v":49.63784395097747,"d":"49.6"}},{"$f":"(Tl_cool-((G25/$G$14)/(1006*N25*$K$14)))*$M$14+$O$14","v":{"v":16.52504864352948,"d":"16.5"}},null,null,{"v":1,"d":"1.000"},{"$nulls":3},{"$f":"IF($W$16=1,AE25,IF($W$16=2,AL25,IF($W$16=3,AS25,IF($W$16=4,AZ25,IF($W$16=5,BG25,IF($W$16=6,BN25,IF($W$16=7,BU25,IF($W$16=8,CB25))))))))","v":-360.6249421804783},"b",{"$f":"IF($W$16=1,AG25,IF($W$16=2,AN25,IF($W$16=3,AU25,IF($W$16=4,BB25,IF($W$16=5,BI25,IF($W$16=6,BP25,IF($W$16=7,BW25,IF($W$16=8,CD25))))))))","v":0.9525315558861097},"b",44.8,7.2,223,"e",0.1875,"b",-1.7187,"b",{"v":36,"d":"36.0"},{"v":2.7,"d":"2.700"},86,-20.638280598544444,"b",-6.059264854502995,"b",43.5,4.1,170,-360.6249421804783,"b",0.9525315558861097,"b",44.8,7.2,223,-6.434274912644452,"b",-1.800745182102678,"b",44.8,5.7,144,4.06086190704667,"b",2.4216316716249207,"b",42.4,5.7,238,-41.88656907342378,"b",1.970736777301756,"b",42.4,5.9,168]
[null,{"v":0.8,"d":"80%"},8,{"$f":"(($W$23*$C26^4+$W$24*$C26^3+$W$25*$C26^2+$W$26*$C26+$W$27)*((((Tv_heat-Tr_heat)/LN((Tv_heat-Tl_heat)/(Tr_heat-Tl_heat)))/((75-65)/LN((75-20)/(65-20))))^1))*$D$14*$AA$11","v":{"v":2775.2669612238165,"d":"2775"}},{"$f":"ROUND(((D26/$D$14)/((Tv_heat-Tr_heat)*1.163))*$E$14,IF($W$4=1,0,IF($W$4=2,2)))","v":95},{"v":0.34609529231329444,"d":"0.35"},{"$f":"(($Y$23*$C26^4+$Y$24*$C26^3+$Y$25*$C26^2+$Y$26*$C26+$Y$27)*((((Tv_cool-Tr_cool)/LN((Tv_cool-Tl_cool)/(Tr_cool-Tl_cool)))/((16-18)/LN((16-27)/(18-27))))^S26))*$G$14*$AA$11","v":{"v":307.01215174429893,"d":"307"}},{"$f":"((G26/$G$14)/(IF((237.3*LN((RH*EXP(17.27*(Tl_cool/(Tl_cool+237.3))))))/(17.27-LN((RH*EXP(17.27*(Tl_cool/(Tl_cool+237.3))))))<((Tv_cool+Tr_cool)/2),1,IF(1/(1+((2258*((0.622/((p_atm/(1*611*EXP(17.27*(((Tv_cool+Tr_cool)/2)/(((Tv_cool+Tr_cool)/2)+237.3))))))-1)*1000-(0.622/((p_atm/(RH*611*EXP(17.27*(Tl_cool/(Tl_cool+237.3))))))-1)*1000))/(1005*(((Tv_cool+Tr_cool)/2)-Tl_cool))))*1.039+((-0.000729*$C26+0.001448)*(Tl_cool-((Tv_cool+Tr_cool)/2))+(0.016908*$C26-0.033574))*1.039>1,1,1/(1+((2258*((0.622/((p_atm/(1*611*EXP(17.27*(((Tv_cool+Tr_cool)/2)/(((Tv_cool+Tr_cool)/2)+237.3))))))-1)*1000-(0.622/((p_atm/(RH*611*EXP(17.27*(Tl_cool/(Tl_cool+237.3))))))-1)*1000))/(1005*(((Tv_cool+Tr_cool)/2)-Tl_cool))))*1.039+((-0.000729*$C26+0.001448)*(Tl_cool-((Tv_cool+Tr_cool)/2))+(0.016908*$C26-0.033574))*1.039))))*$H$14","v":{"v":307.01215174429893,"d":"307"}},{"$f":"ROUND(((H26/$H$14)/((Tr_cool-Tv_cool)*1.163))*$I$14,IF($W$4=1,0,IF($W$4=2,2)))","v":53},{"v":0.12001521195322754,"d":"0.12"},41.5,49.5,11.5,287,{"$f":"(Tl_heat+(($D26/$G$14)/(1006*$N26*$K$14)))*$M$14+$O$14","v":{"v":48.74093562533993,"d":"48.7"}},{"$f":"(Tl_cool-((G26/$G$14)/(1006*N26*$K$14)))*$M$14+$O$14","v":{"v":16.820552180108493,"d":"16.8"}},null,null,{"v":1,"d":"1.000"},{"$nulls":3},{"$f":"IF($W$16=1,AE26,IF($W$16=2,AL26,IF($W$16=3,AS26,IF($W$16=4,AZ26,IF($W$16=5,BG26,IF($W$16=6,BN26,IF($W$16=7,BU26,IF($W$16=8,CB26))))))))","v":1211.686145735049},1.8148096460023067,{"$f":"IF($W$16=1,AG26,IF($W$16=2,AN26,IF($W$16=3,AU26,IF($W$16=4,BB26,IF($W$16=5,BI26,IF($W$16=6,BP26,IF($W$16=7,BW26,IF($W$16=8,CD26))))))))","v":6.878863960408994},1.8148096460023067,49.5,11.5,287,"f",155,null,50.75,{"$f":"AF26","v":0},40.5,{"v":4.6,"d":"4.600"},116,681.8402246422323,{"$f":"AF26","v":0},159.76851409190598,2,49.5,7.7,228,1211.686145735049,1.8148096460023067,6.878863960408994,1.8148096460023067,49.5,11.5,287,80.73214551936076,1.8148096460023067,21.4930527859506,1.8148096460023067,49.5,8.4,194,251.43285822089797,1.8208138694468972,20.92701538796936,1.8208138694468972,47.9,9.6,291,185.13171418104602,1.8148096460023067,12.859546260831442,1.8208138694468972,47.9,{"v":10,"d":"10.0"},228]
[null,{"v":1,"d":"100%"},10,{"$f":"(($W$23*$C27^4+$W$24*$C27^3+$W$25*$C27^2+$W$26*$C27+$W$27)*((((Tv_heat-Tr_heat)/LN((Tv_heat-Tl_heat)/(Tr_heat-Tl_heat)))/((75-65)/LN((75-20)/(65-20))))^1))*$D$14*$AA$11","v":{"v":3401.5722821413633,"d":"3402"}},{"$f":"ROUND(((D27/$D$14)/((Tv_heat-Tr_heat)*1.163))*$E$14,IF($W$4=1,0,IF($W$4=2,2)))","v":117},{"v":0.5050884849640702,"d":"0.51"},{"$f":"(($Y$23*$C27^4+$Y$24*$C27^3+$Y$25*$C27^2+$Y$26*$C27+$Y$27)*((((Tv_cool-Tr_cool)/LN((Tv_cool-Tl_cool)/(Tr_cool-Tl_cool)))/((16-18)/LN((16-27)/(18-27))))^S27))*$G$14*$AA$11","v":{"v":364.1071722460002,"d":"364"}},{"$f":"((G27/$G$14)/(IF((237.3*LN((RH*EXP(17.27*(Tl_cool/(Tl_cool+237.3))))))/(17.27-LN((RH*EXP(17.27*(Tl_cool/(Tl_cool+237.3))))))<((Tv_cool+Tr_cool)/2),1,IF(1/(1+((2258*((0.622/((p_atm/(1*611*EXP(17.27*(((Tv_cool+Tr_cool)/2)/(((Tv_cool+Tr_cool)/2)+237.3))))))-1)*1000-(0.622/((p_atm/(RH*611*EXP(17.27*(Tl_cool/(Tl_cool+237.3))))))-1)*1000))/(1005*(((Tv_cool+Tr_cool)/2)-Tl_cool))))*1.039+((-0.000729*$C27+0.001448)*(Tl_cool-((Tv_cool+Tr_cool)/2))+(0.016908*$C27-0.033574))*1.039>1,1,1/(1+((2258*((0.622/((p_atm/(1*611*EXP(17.27*(((Tv_cool+Tr_cool)/2)/(((Tv_cool+Tr_cool)/2)+237.3))))))-1)*1000-(0.622/((p_atm/(RH*611*EXP(17.27*(Tl_cool/(Tl_cool+237.3))))))-1)*1000))/(1005*(((Tv_cool+Tr_cool)/2)-Tl_cool))))*1.039+((-0.000729*$C27+0.001448)*(Tl_cool-((Tv_cool+Tr_cool)/2))+(0.016908*$C27-0.033574))*1.039))))*$H$14","v":{"v":364.1071722460002,"d":"364"}},{"$f":"ROUND(((H27/$H$14)/((Tr_cool-Tv_cool)*1.163))*$I$14,IF($W$4=1,0,IF($W$4=2,2)))","v":63},{"v":0.1642345033564779,"d":"0.16"},44.5,52.5,{"v":18,"d":"18.0"},346,{"$f":"(Tl_heat+(($D27/$G$14)/(1006*$N27*$K$14)))*$M$14+$O$14","v":{"v":49.220095992394214,"d":"49.2"}},{"$f":"(Tl_cool-((G27/$G$14)/(1006*N27*$K$14)))*$M$14+$O$14","v":{"v":16.872256226802946,"d":"16.9"}},null,null,{"v":1,"d":"1.000"},{"$nulls":3},{"$f":"IF($W$16=1,AE27,IF($W$16=2,AL27,IF($W$16=3,AS27,IF($W$16=4,AZ27,IF($W$16=5,BG27,IF($W$16=6,BN27,IF($W$16=7,BU27,IF($W$16=8,CB27))))))))","v":237.14568715178913},0,{"$f":"IF($W$16=1,AG27,IF($W$16=2,AN27,IF($W$16=3,AU27,IF($W$16=4,BB27,IF($W$16=5,BI27,IF($W$16=6,BP27,IF($W$16=7,BW27,IF($W$16=8,CD27))))))))","v":173.5639004431571},0,52.5,18,346,"g",53.25,null,-58.625,null,{"v":48,"d":"48.0"},{"v":7.1,"d":"7.100"},145,-893.1042789624167,null,-240.26078124661026,null,{"v":54,"d":"54.0"},13.2,281,237.14568715178913,null,173.5639004431571,null,52.5,{"v":18,"d":"18.0"},346,1067.2269380900811,null,110.71690101532077,null,52.5,14.4,229,1733.6902910445228,null,244.82210443399327,null,51.5,15.6,332,758.5353119327127,null,192.26108685256855,null,51.5,15.6,257]
[null,{"$f":"IF($S$7=1,NL!B28,IF(cal!$S$7=2,EN!B28,IF(cal!$S$7=3,DE!B28,IF(cal!$S$7=4,FR!B28,IF(cal!$S$7=5,NR!B28,IF(cal!$S$7=6,SP!B28,IF(cal!$S$7=7,SW!B28,IF(cal!$S$7=8,TS!B28,IF(cal!$S$7=9,RU!B28,IF(cal!$S$7=10,ExtraTaal2!B28,IF(cal!$S$7=11,ExtraTaal3!B28,)))))))))))","v":"Briza Net Zero M H42 2P Высота 42 cm Ширина 14 cm Длина 125 cm (Тип 3)"},{"$nulls":16},"n-value",{"$nulls":3},"H",{"$f":"IF($W$16=1,AF28,IF($W$16=2,AM28,IF($W$16=3,AT28,IF($W$16=4,BA28,IF($W$16=5,BH28,IF($W$16=6,BO28,IF($W$16=7,BV28,IF($W$16=8,CC28))))))))*IF($W$4=1,1,IF($W$4=2,1/2.54))","v":{"v":42,"d":"42.0"}},"B",{"$f":"IF($W$16=1,AH28,IF($W$16=2,AO28,IF($W$16=3,AV28,IF($W$16=4,BC28,IF($W$16=5,BJ28,IF($W$16=6,BQ28,IF($W$16=7,BX28,IF($W$16=8,CE28))))))))*IF($W$4=1,1,IF($W$4=2,1/2.54))","v":{"v":14,"d":"14.0"}},"L",{"$f":"IF($W$16=1,AJ28,IF($W$16=2,AQ28,IF($W$16=3,AX28,IF($W$16=4,BE28,IF($W$16=5,BL28,IF($W$16=6,BS28,IF($W$16=7,BZ28,IF($W$16=8,CG28))))))))*IF($W$4=1,1,IF($W$4=2,1/2.54))","v":{"v":95,"d":"95.0"}},null,null,"H",{"$f":"IF(AI1=AH2,AL4,AM4)","v":52.1},"B",{"$f":"IF(AI1=AH2,AL3,AM3)","v":8.5},"L",{"$f":"IF(AI1=AH2,AL6,AM6)","v":122},72,"H",{"$f":"IF(AI1=AH2,AN4,AO4)","v":55.8},"B",{"$f":"IF(AI1=AH2,AN3,AO3)","v":11},"L",{"$f":"IF(AI1=AH2,AN6,AO6)","v":110},null,"H",{"$f":"IF(AI1=AH2,AP4,AQ4)","v":42},"B",{"$f":"IF(AI1=AH2,AP3,AQ3)","v":14},"L",{"$f":"IF(AI1=AH2,AP6,AQ6)","v":95},null,"H",{"$f":"AT28","v":42},{"$f":"AU28","v":"B"},14,"L",95,null,"H",{"$f":"IF(AI1=AH3,AR4,AS4)","v":56},"B",{"$f":"IF(AI1=AH2,AR3,AS3)","v":14},"L",{"$f":"IF(AI1=AH2,AR6,AS6)","v":95},null,"H",{"$f":"BH28","v":56},{"$f":"BI28","v":"B"},14,"L",95]
[null,{"v":0.2,"d":"20%"},2,{"$f":"(($W$29*$C29^4+$W$30*$C29^3+$W$31*$C29^2+$W$32*$C29+$W$33)*((((Tv_heat-Tr_heat)/LN((Tv_heat-Tl_heat)/(Tr_heat-Tl_heat)))/((75-65)/LN((75-20)/(65-20))))^1))*$D$14*$AA$11","v":{"v":3007.551135484291,"d":"3008"}},{"$f":"ROUND(((D29/$D$14)/((Tv_heat-Tr_heat)*1.163))*$E$14,IF($W$4=1,0,IF($W$4=2,2)))","v":103},{"$f":"IF($AA$1=1,IF((POWER(((E29/$I$14)/1000)/$X$30,2)*100)*$J$14<0.01,0.01,(POWER(((E29/$I$14)/1000)/$X$30,2)*100)*$J$14),($X$30*(E29/$E$14)^$X$32)*$F$14)","v":{"v":0.5412120845627276,"d":"0.54"}},{"$f":"(($Y$29*$C29^4+$Y$30*$C29^3+$Y$31*$C29^2+$Y$32*$C29+$Y$33)*((((Tv_cool-Tr_cool)/LN((Tv_cool-Tl_cool)/(Tr_cool-Tl_cool)))/((16-18)/LN((16-27)/(18-27))))^S29))*$G$14*$AA$11","v":{"v":323.85511824960383,"d":"324"}},{"$f":"((G29/$G$14)/(IF((237.3*LN((RH*EXP(17.27*(Tl_cool/(Tl_cool+237.3))))))/(17.27-LN((RH*EXP(17.27*(Tl_cool/(Tl_cool+237.3))))))<((Tv_cool+Tr_cool)/2),1,IF(1/(1+((2258*((0.622/((p_atm/(1*611*EXP(17.27*(((Tv_cool+Tr_cool)/2)/(((Tv_cool+Tr_cool)/2)+237.3))))))-1)*1000-(0.622/((p_atm/(RH*611*EXP(17.27*(Tl_cool/(Tl_cool+237.3))))))-1)*1000))/(1005*(((Tv_cool+Tr_cool)/2)-Tl_cool))))*1.039+((-0.000729*$C29+0.001448)*(Tl_cool-((Tv_cool+Tr_cool)/2))+(0.016908*$C29-0.033574))*1.039>1,1,1/(1+((2258*((0.622/((p_atm/(1*611*EXP(17.27*(((Tv_cool+Tr_cool)/2)/(((Tv_cool+Tr_cool)/2)+237.3))))))-1)*1000-(0.622/((p_atm/(RH*611*EXP(17.27*(Tl_cool/(Tl_cool+237.3))))))-1)*1000))/(1005*(((Tv_cool+Tr_cool)/2)-Tl_cool))))*1.039+((-0.000729*$C29+0.001448)*(Tl_cool-((Tv_cool+Tr_cool)/2))+(0.016908*$C29-0.033574))*1.039))))*$H$14","v":{"v":323.85511824960383,"d":"324"}},{"$f":"ROUND(((H29/$H$14)/((Tr_cool-Tv_cool)*1.163))*$I$14,IF($W$4=1,0,IF($W$4=2,2)))","v":56},{"$f":"IF($AA$1=1,IF((POWER(((I29/$I$14)/1000)/$X$30,2)*100)*$J$14<0.01,0.01,(POWER(((I29/$I$14)/1000)/$X$30,2)*100)*$J$14),($Z$30*(I29/$I$14)^$Z$32)*$J$14)","v":{"v":0.17912036891354097,"d":"0.18"}},{"$f":"IF(AA29<28,\"<20\",L29-8)","v":24.6},{"$f":"IF(AA29<20,\"<20\",AA29)","v":32.6},{"$f":"AB29","v":2.6},{"$f":"AC29*$N$14","v":146},{"$f":"(Tl_heat+(($D29/$G$14)/(1006*$N29*$K$14)))*$M$14+$O$14","v":{"v":81.22632570154698,"d":"81.2"}},{"$f":"(Tl_cool-((G29/$G$14)/(1006*N29*$K$14)))*$M$14+$O$14","v":{"v":13.407108289492015,"d":"13.4"}},null,null,{"v":1,"d":"1.000"},{"$nulls":3},{"$f":"IF($W$16=1,AE29,IF($W$16=2,AL29,IF($W$16=3,AS29,IF($W$16=4,AZ29,IF($W$16=5,BG29,IF($W$16=6,BN29,IF($W$16=7,BU29,IF($W$16=8,CB29))))))))","v":-2.6386736307091345E-3},{"$f":"IF($W$16=1,AF29,IF($W$16=2,AM29,IF($W$16=3,AT29,IF($W$16=4,BA29,IF($W$16=5,BH29,IF($W$16=6,BO29,IF($W$16=7,BV29,IF($W$16=8,CC29))))))))","v":"a"},{"$f":"IF($W$16=1,AG29,IF($W$16=2,AN29,IF($W$16=3,AU29,IF($W$16=4,BB29,IF($W$16=5,BI29,IF($W$16=6,BP29,IF($W$16=7,BW29,IF($W$16=8,CD29))))))))","v":0},{"$f":"IF($W$16=1,AH29,IF($W$16=2,AO29,IF($W$16=3,AV29,IF($W$16=4,BC29,IF($W$16=5,BJ29,IF($W$16=6,BQ29,IF($W$16=7,BX29,IF($W$16=8,CE29))))))))","v":"a"},{"$f":"IF($W$16=1,AI29,IF($W$16=2,AP29,IF($W$16=3,AW29,IF($W$16=4,BD29,IF($W$16=5,BK29,IF($W$16=6,BR29,IF($W$16=7,BY29,IF($W$16=8,CF29))))))))","v":32.6},{"$f":"IF($W$16=1,AJ29,IF($W$16=2,AQ29,IF($W$16=3,AX29,IF($W$16=4,BE29,IF($W$16=5,BL29,IF($W$16=6,BS29,IF($W$16=7,BZ29,IF($W$16=8,CG29))))))))","v":2.6},{"$f":"IF($W$16=1,AK29,IF($W$16=2,AR29,IF($W$16=3,AY29,IF($W$16=4,BF29,IF($W$16=5,BM29,IF($W$16=6,BT29,IF($W$16=7,CA29,IF($W$16=8,CH29))))))))","v":146},"c",0,"a",null,"a",23.5,{"v":1.1,"d":"1.100"},39,1.0995266671270435E-3,"a",-0.000788408634981302,"a",30.5,{"v":2,"d":"2.0"},56,-2.6386736307091345E-3,"a",null,"a",32.6,2.6,146,null,"a",null,"a",32.6,2.3,73,null,"a",null,"a",31.1,2.8,153,-0.26784940737322377,"a",null,"a",31.1,2.3,112]
[null,{"v":0.4,"d":"40%"},4,{"$f":"(($W$29*$C30^4+$W$30*$C30^3+$W$31*$C30^2+$W$32*$C30+$W$33)*((((Tv_heat-Tr_heat)/LN((Tv_heat-Tl_heat)/(Tr_heat-Tl_heat)))/((75-65)/LN((75-20)/(65-20))))^1))*$D$14*$AA$11","v":{"v":3361.6414880914385,"d":"3362"}},{"$f":"ROUND(((D30/$D$14)/((Tv_heat-Tr_heat)*1.163))*$E$14,IF($W$4=1,0,IF($W$4=2,2)))","v":116},{"$f":"IF($AA$1=1,IF((POWER(((E30/$I$14)/1000)/$X$30,2)*100)*$J$14<0.01,0.01,(POWER(((E30/$I$14)/1000)/$X$30,2)*100)*$J$14),($X$30*(E30/$E$14)^$X$32)*$F$14)","v":{"v":0.6714854225113867,"d":"0.67"}},{"$f":"(($Y$29*$C30^4+$Y$30*$C30^3+$Y$31*$C30^2+$Y$32*$C30+$Y$33)*((((Tv_cool-Tr_cool)/LN((Tv_cool-Tl_cool)/(Tr_cool-Tl_cool)))/((16-18)/LN((16-27)/(18-27))))^S30))*$G$14*$AA$11","v":{"v":358.5314353810638,"d":"359"}},{"$f":"((G30/$G$14)/(IF((237.3*LN((RH*EXP(17.27*(Tl_cool/(Tl_cool+237.3))))))/(17.27-LN((RH*EXP(17.27*(Tl_cool/(Tl_cool+237.3))))))<((Tv_cool+Tr_cool)/2),1,IF(1/(1+((2258*((0.622/((p_atm/(1*611*EXP(17.27*(((Tv_cool+Tr_cool)/2)/(((Tv_cool+Tr_cool)/2)+237.3))))))-1)*1000-(0.622/((p_atm/(RH*611*EXP(17.27*(Tl_cool/(Tl_cool+237.3))))))-1)*1000))/(1005*(((Tv_cool+Tr_cool)/2)-Tl_cool))))*1.039+((-0.000729*$C30+0.001448)*(Tl_cool-((Tv_cool+Tr_cool)/2))+(0.016908*$C30-0.033574))*1.039>1,1,1/(1+((2258*((0.622/((p_atm/(1*611*EXP(17.27*(((Tv_cool+Tr_cool)/2)/(((Tv_cool+Tr_cool)/2)+237.3))))))-1)*1000-(0.622/((p_atm/(RH*611*EXP(17.27*(Tl_cool/(Tl_cool+237.3))))))-1)*1000))/(1005*(((Tv_cool+Tr_cool)/2)-Tl_cool))))*1.039+((-0.000729*$C30+0.001448)*(Tl_cool-((Tv_cool+Tr_cool)/2))+(0.016908*$C30-0.033574))*1.039))))*$H$14","v":{"v":358.5314353810638,"d":"359"}},{"$f":"ROUND(((H30/$H$14)/((Tr_cool-Tv_cool)*1.163))*$I$14,IF($W$4=1,0,IF($W$4=2,2)))","v":62},{"$f":"IF($AA$1=1,IF((POWER(((I30/$I$14)/1000)/$X$30,2)*100)*$J$14<0.01,0.01,(POWER(((I30/$I$14)/1000)/$X$30,2)*100)*$J$14),($Z$30*(I30/$I$14)^$Z$32)*$J$14)","v":{"v":0.21545435821484804,"d":"0.22"}},{"$f":"IF(AA30<28,\"<20\",L30-8)","v":{"v":30.200000000000003,"d":"30.2"}},{"$f":"IF(AA30<20,\"<20\",AA30)","v":38.2},4.8,221,{"$f":"(Tl_heat+(($D30/$G$14)/(1006*$N30*$K$14)))*$M$14+$O$14","v":{"v":65.2102755945543,"d":"65.2"}},{"$f":"(Tl_cool-((G30/$G$14)/(1006*N30*$K$14)))*$M$14+$O$14","v":{"v":15.1781577362398,"d":"15.2"}},null,null,{"v":1,"d":"1.000"},{"$nulls":3},1.4785661107548795,1.2048931502827451E-4,0.09571949914823337,1.2048931502827451E-4,38.2,4.8,221,"d",0,1.638736,null,{"$f":"AF30","v":1.638736},{"v":26,"d":"26.0"},{"v":2.1,"d":"2.100"},65,-0.03667333078701452,1.09500719969601,-1.42406001391585E-3,1.09500719969601,{"v":38,"d":"38.0"},3.4,130,1.4785661107548795,1.2048931502827451E-4,0.09571949914823337,1.2048931502827451E-4,38.2,4.8,221,1.0636516905207274,1.2048931502827451E-4,0.17123517161163615,1.2048931502827451E-4,38.2,4.1,149,-0.8815084963588697,2.364386444169621E-4,-0.2615692786811772,2.364386444169621E-4,37.1,5.4,236,7.545208833492138,1.2048931502827451E-4,-0.20123481722729702,2.364386444169621E-4,37.1,4.2,183]
[null,{"v":0.6,"d":"60%"},6,{"$f":"(($W$29*$C31^4+$W$30*$C31^3+$W$31*$C31^2+$W$32*$C31+$W$33)*((((Tv_heat-Tr_heat)/LN((Tv_heat-Tl_heat)/(Tr_heat-Tl_heat)))/((75-65)/LN((75-20)/(65-20))))^1))*$D$14*$AA$11","v":{"v":3822.655355582246,"d":"3823"}},{"$f":"ROUND(((D31/$D$14)/((Tv_heat-Tr_heat)*1.163))*$E$14,IF($W$4=1,0,IF($W$4=2,2)))","v":131},{"v":0.8372779119001486,"d":"0.84"},{"$f":"(($Y$29*$C31^4+$Y$30*$C31^3+$Y$31*$C31^2+$Y$32*$C31+$Y$33)*((((Tv_cool-Tr_cool)/LN((Tv_cool-Tl_cool)/(Tr_cool-Tl_cool)))/((16-18)/LN((16-27)/(18-27))))^S31))*$G$14*$AA$11","v":{"v":409.1737721239133,"d":"409"}},{"$f":"((G31/$G$14)/(IF((237.3*LN((RH*EXP(17.27*(Tl_cool/(Tl_cool+237.3))))))/(17.27-LN((RH*EXP(17.27*(Tl_cool/(Tl_cool+237.3))))))<((Tv_cool+Tr_cool)/2),1,IF(1/(1+((2258*((0.622/((p_atm/(1*611*EXP(17.27*(((Tv_cool+Tr_cool)/2)/(((Tv_cool+Tr_cool)/2)+237.3))))))-1)*1000-(0.622/((p_atm/(RH*611*EXP(17.27*(Tl_cool/(Tl_cool+237.3))))))-1)*1000))/(1005*(((Tv_cool+Tr_cool)/2)-Tl_cool))))*1.039+((-0.000729*$C31+0.001448)*(Tl_cool-((Tv_cool+Tr_cool)/2))+(0.016908*$C31-0.033574))*1.039>1,1,1/(1+((2258*((0.622/((p_atm/(1*611*EXP(17.27*(((Tv_cool+Tr_cool)/2)/(((Tv_cool+Tr_cool)/2)+237.3))))))-1)*1000-(0.622/((p_atm/(RH*611*EXP(17.27*(Tl_cool/(Tl_cool+237.3))))))-1)*1000))/(1005*(((Tv_cool+Tr_cool)/2)-Tl_cool))))*1.039+((-0.000729*$C31+0.001448)*(Tl_cool-((Tv_cool+Tr_cool)/2))+(0.016908*$C31-0.033574))*1.039))))*$H$14","v":{"v":409.1737721239133,"d":"409"}},{"$f":"ROUND(((H31/$H$14)/((Tr_cool-Tv_cool)*1.163))*$I$14,IF($W$4=1,0,IF($W$4=2,2)))","v":70},{"v":0.2685308896463024,"d":"0.27"},{"v":37,"d":"37.0"},{"v":45,"d":"45.0"},{"v":8,"d":"8.0"},298,{"$f":"(Tl_heat+(($D31/$G$14)/(1006*$N31*$K$14)))*$M$14+$O$14","v":{"v":58.12649776411239,"d":"58.1"}},{"$f":"(Tl_cool-((G31/$G$14)/(1006*N31*$K$14)))*$M$14+$O$14","v":{"v":15.91897216545182,"d":"15.9"}},null,null,{"v":1,"d":"1.000"},{"$nulls":3},-6.676712313973501,"b",0.7827958312026129,"b",45,8,298,"e",0.2943,"b",{"v":-2.6974,"d":"-2.7"},"b",35.5,{"v":4,"d":"4.000"},111,-32.00210784125337,"b",-9.344563299573192,"b",44.5,6.5,227,-6.676712313973501,"b",0.7827958312026129,"b",{"v":45,"d":"45.0"},{"v":8,"d":"8.0"},298,-4.235884897558331,"b",-1.4664081399657958,"b",{"v":45,"d":"45.0"},7.4,220,10.601704948047237,"b",4.67346178430048,"b",44.5,{"v":10,"d":"10.0"},321,-62.125133979184696,"b",3.3370194060807656,"b",44.5,7.5,260]
[null,{"v":0.8,"d":"80%"},8,{"$f":"(($W$29*$C32^4+$W$30*$C32^3+$W$31*$C32^2+$W$32*$C32+$W$33)*((((Tv_heat-Tr_heat)/LN((Tv_heat-Tl_heat)/(Tr_heat-Tl_heat)))/((75-65)/LN((75-20)/(65-20))))^1))*$D$14*$AA$11","v":{"v":4475.27024866499,"d":"4475"}},{"$f":"ROUND(((D32/$D$14)/((Tv_heat-Tr_heat)*1.163))*$E$14,IF($W$4=1,0,IF($W$4=2,2)))","v":154},{"v":1.122901357846333,"d":"1.12"},{"$f":"(($Y$29*$C32^4+$Y$30*$C32^3+$Y$31*$C32^2+$Y$32*$C32+$Y$33)*((((Tv_cool-Tr_cool)/LN((Tv_cool-Tl_cool)/(Tr_cool-Tl_cool)))/((16-18)/LN((16-27)/(18-27))))^S32))*$G$14*$AA$11","v":{"v":480.52967679906385,"d":"481"}},{"$f":"((G32/$G$14)/(IF((237.3*LN((RH*EXP(17.27*(Tl_cool/(Tl_cool+237.3))))))/(17.27-LN((RH*EXP(17.27*(Tl_cool/(Tl_cool+237.3))))))<((Tv_cool+Tr_cool)/2),1,IF(1/(1+((2258*((0.622/((p_atm/(1*611*EXP(17.27*(((Tv_cool+Tr_cool)/2)/(((Tv_cool+Tr_cool)/2)+237.3))))))-1)*1000-(0.622/((p_atm/(RH*611*EXP(17.27*(Tl_cool/(Tl_cool+237.3))))))-1)*1000))/(1005*(((Tv_cool+Tr_cool)/2)-Tl_cool))))*1.039+((-0.000729*$C32+0.001448)*(Tl_cool-((Tv_cool+Tr_cool)/2))+(0.016908*$C32-0.033574))*1.039>1,1,1/(1+((2258*((0.622/((p_atm/(1*611*EXP(17.27*(((Tv_cool+Tr_cool)/2)/(((Tv_cool+Tr_cool)/2)+237.3))))))-1)*1000-(0.622/((p_atm/(RH*611*EXP(17.27*(Tl_cool/(Tl_cool+237.3))))))-1)*1000))/(1005*(((Tv_cool+Tr_cool)/2)-Tl_cool))))*1.039+((-0.000729*$C32+0.001448)*(Tl_cool-((Tv_cool+Tr_cool)/2))+(0.016908*$C32-0.033574))*1.039))))*$H$14","v":{"v":480.52967679906385,"d":"481"}},{"$f":"ROUND(((H32/$H$14)/((Tr_cool-Tv_cool)*1.163))*$I$14,IF($W$4=1,0,IF($W$4=2,2)))","v":83},{"v":0.3657932435979751,"d":"0.37"},42.5,50.5,{"v":14,"d":"14.0"},381,{"$f":"(Tl_heat+(($D32/$G$14)/(1006*$N32*$K$14)))*$M$14+$O$14","v":{"v":54.911806649820356,"d":"54.9"}},{"$f":"(Tl_cool-((G32/$G$14)/(1006*N32*$K$14)))*$M$14+$O$14","v":{"v":16.25136399954527,"d":"16.3"}},null,null,{"v":1,"d":"1.000"},{"$nulls":3},142.06849285698914,1.8145625016160318,9.402432844199659,1.8145625016160318,50.5,14,381,"f",243.26,null,{"v":79.649,"d":"79.6"},{"$f":"AF32","v":0},42.5,{"v":6.6,"d":"6.600"},148,1068.508954252284,{"$f":"AF32","v":0},250.02480896377855,2,50.5,11.5,331,142.06849285698914,1.8145625016160318,9.402432844199659,1.8145625016160318,50.5,{"v":14,"d":"14.0"},381,114.94135317144828,1.8145625016160318,22.25052488649974,1.8145625016160318,50.5,12.6,278,390.82080301438873,1.8120794599034276,26.676957361613045,1.8120794599034276,50.5,{"v":18,"d":"18.0"},398,307.8019217888039,1.8145625016160318,23.256603866829582,1.8120794599034276,50.5,12.8,328]
[null,{"v":1,"d":"100%"},10,{"$f":"(($W$29*$C33^4+$W$30*$C33^3+$W$31*$C33^2+$W$32*$C33+$W$33)*((((Tv_heat-Tr_heat)/LN((Tv_heat-Tl_heat)/(Tr_heat-Tl_heat)))/((75-65)/LN((75-20)/(65-20))))^1))*$D$14*$AA$11","v":{"v":5402.90999608246,"d":"5403"}},{"$f":"ROUND(((D33/$D$14)/((Tv_heat-Tr_heat)*1.163))*$E$14,IF($W$4=1,0,IF($W$4=2,2)))","v":186},{"v":1.5816909181382854,"d":"1.58"},{"$f":"(($Y$29*$C33^4+$Y$30*$C33^3+$Y$31*$C33^2+$Y$32*$C33+$Y$33)*((((Tv_cool-Tr_cool)/LN((Tv_cool-Tl_cool)/(Tr_cool-Tl_cool)))/((16-18)/LN((16-27)/(18-27))))^S33))*$G$14*$AA$11","v":{"v":577.3466977274268,"d":"577"}},{"$f":"((G33/$G$14)/(IF((237.3*LN((RH*EXP(17.27*(Tl_cool/(Tl_cool+237.3))))))/(17.27-LN((RH*EXP(17.27*(Tl_cool/(Tl_cool+237.3))))))<((Tv_cool+Tr_cool)/2),1,IF(1/(1+((2258*((0.622/((p_atm/(1*611*EXP(17.27*(((Tv_cool+Tr_cool)/2)/(((Tv_cool+Tr_cool)/2)+237.3))))))-1)*1000-(0.622/((p_atm/(RH*611*EXP(17.27*(Tl_cool/(Tl_cool+237.3))))))-1)*1000))/(1005*(((Tv_cool+Tr_cool)/2)-Tl_cool))))*1.039+((-0.000729*$C33+0.001448)*(Tl_cool-((Tv_cool+Tr_cool)/2))+(0.016908*$C33-0.033574))*1.039>1,1,1/(1+((2258*((0.622/((p_atm/(1*611*EXP(17.27*(((Tv_cool+Tr_cool)/2)/(((Tv_cool+Tr_cool)/2)+237.3))))))-1)*1000-(0.622/((p_atm/(RH*611*EXP(17.27*(Tl_cool/(Tl_cool+237.3))))))-1)*1000))/(1005*(((Tv_cool+Tr_cool)/2)-Tl_cool))))*1.039+((-0.000729*$C33+0.001448)*(Tl_cool-((Tv_cool+Tr_cool)/2))+(0.016908*$C33-0.033574))*1.039))))*$H$14","v":{"v":577.3466977274268,"d":"577"}},{"$f":"ROUND(((H33/$H$14)/((Tr_cool-Tv_cool)*1.163))*$I$14,IF($W$4=1,0,IF($W$4=2,2)))","v":99},{"v":0.5036783996848484,"d":"0.50"},{"v":47,"d":"47.0"},{"v":55,"d":"55.0"},{"v":24,"d":"24.0"},448,{"$f":"(Tl_heat+(($D33/$G$14)/(1006*$N33*$K$14)))*$M$14+$O$14","v":{"v":55.84493127608798,"d":"55.8"}},{"$f":"(Tl_cool-((G33/$G$14)/(1006*N33*$K$14)))*$M$14+$O$14","v":{"v":16.169665473324294,"d":"16.2"}},null,null,{"v":1,"d":"1.000"},{"$nulls":3},2161.5461388359286,0,290.7155392231125,0,55,24,448,"g",83.573,null,{"v":-92.009,"d":"-92.0"},null,50.5,{"v":10.1,"d":"10.100"},188,-1399.6368650421423,null,-376.30360318598724,null,{"v":56,"d":"56.0"},19.7,392,2161.5461388359286,null,290.7155392231125,null,{"v":55,"d":"55.0"},{"v":24,"d":"24.0"},448,1703.0145175312946,null,199.95460885224878,null,{"v":55,"d":"55.0"},20.9,364,2743.7411285852236,null,404.4385594902665,null,54.5,28.8,467,1146.7350020499362,null,292.495395595261,null,54.5,22.3,385]
[null,{"$f":"IF($S$7=1,NL!B34,IF(cal!$S$7=2,EN!B34,IF(cal!$S$7=3,DE!B34,IF(cal!$S$7=4,FR!B34,IF(cal!$S$7=5,NR!B34,IF(cal!$S$7=6,SP!B34,IF(cal!$S$7=7,SW!B34,IF(cal!$S$7=8,TS!B34,IF(cal!$S$7=9,RU!B34,IF(cal!$S$7=10,ExtraTaal2!B34,IF(cal!$S$7=11,ExtraTaal3!B34,)))))))))))","v":"Briza Net Zero M H42 2P Высота 42 cm Ширина 14 cm Длина 145 cm (Тип 4)"},{"$nulls":16},"n-value",{"$nulls":3},"H",{"$f":"IF($W$16=1,AF34,IF($W$16=2,AM34,IF($W$16=3,AT34,IF($W$16=4,BA34,IF($W$16=5,BH34,IF($W$16=6,BO34,IF($W$16=7,BV34,IF($W$16=8,CC34))))))))*IF($W$4=1,1,IF($W$4=2,1/2.54))","v":{"v":42,"d":"42.0"}},"B",{"$f":"IF($W$16=1,AH34,IF($W$16=2,AO34,IF($W$16=3,AV34,IF($W$16=4,BC34,IF($W$16=5,BJ34,IF($W$16=6,BQ34,IF($W$16=7,BX34,IF($W$16=8,CE34))))))))*IF($W$4=1,1,IF($W$4=2,1/2.54))","v":{"v":14,"d":"14.0"}},"L",{"$f":"IF($W$16=1,AJ34,IF($W$16=2,AQ34,IF($W$16=3,AX34,IF($W$16=4,BE34,IF($W$16=5,BL34,IF($W$16=6,BS34,IF($W$16=7,BZ34,IF($W$16=8,CG34))))))))*IF($W$4=1,1,IF($W$4=2,1/2.54))","v":{"v":125,"d":"125.0"}},null,null,"H",{"$f":"IF(AI1=AH2,AL4,AM4)","v":52.1},"B",{"$f":"IF(AI1=AH2,AL3,AM3)","v":8.5},"L",{"$f":"IF(AI1=AH2,AL7,AM7)","v":163},113,"H",{"$f":"IF(AI1=AH2,AN4,AO4)","v":55.8},"B",{"$f":"IF(AI1=AH2,AN3,AO3)","v":11},"L",{"$f":"IF(AI1=AH2,AN7,AO7)","v":155},null,"H",{"$f":"IF(AI1=AH2,AP4,AQ4)","v":42},"B",{"$f":"IF(AI1=AH2,AP3,AQ3)","v":14},"L",{"$f":"IF(AI1=AH2,AP7,AQ7)","v":125},null,"H",{"$f":"AT34","v":42},{"$f":"AU34","v":"B"},14,"L",125,null,"H",{"$f":"IF(AI1=AH3,AR4,AS4)","v":56},"B",{"$f":"IF(AI1=AH2,AR3,AS3)","v":14},"L",{"$f":"IF(AI1=AH2,AR7,AS7)","v":125},null,"H",{"$f":"BH34","v":56},{"$f":"BI34","v":"B"},14,"L",125]
[null,{"v":0.2,"d":"20%"},2,{"$f":"(($W$35*$C35^4+$W$36*$C35^3+$W$37*$C35^2+$W$38*$C35+$W$39)*((((Tv_heat-Tr_heat)/LN((Tv_heat-Tl_heat)/(Tr_heat-Tl_heat)))/((75-65)/LN((75-20)/(65-20))))^1))*$D$14*$AA$11","v":{"v":3710.2518300192883,"d":"3710"}},{"$f":"ROUND(((D35/$D$14)/((Tv_heat-Tr_heat)*1.163))*$E$14,IF($W$4=1,0,IF($W$4=2,2)))","v":128},{"$f":"IF($AA$1=1,IF((POWER(((E35/$I$14)/1000)/$X$36,2)*100)*$J$14<0.01,0.01,(POWER(((E35/$I$14)/1000)/$X$36,2)*100)*$J$14),($X$36*(E35/$E$14)^$X$38)*$F$14)","v":{"v":0.9257190017234551,"d":"0.93"}},{"$f":"(($Y$35*$C35^4+$Y$36*$C35^3+$Y$37*$C35^2+$Y$38*$C35+$Y$39)*((((Tv_cool-Tr_cool)/LN((Tv_cool-Tl_cool)/(Tr_cool-Tl_cool)))/((16-18)/LN((16-27)/(18-27))))^S35))*$G$14*$AA$11","v":{"v":425.28072036719897,"d":"425"}},{"$f":"((G35/$G$14)/(IF((237.3*LN((RH*EXP(17.27*(Tl_cool/(Tl_cool+237.3))))))/(17.27-LN((RH*EXP(17.27*(Tl_cool/(Tl_cool+237.3))))))<((Tv_cool+Tr_cool)/2),1,IF(1/(1+((2258*((0.622/((p_atm/(1*611*EXP(17.27*(((Tv_cool+Tr_cool)/2)/(((Tv_cool+Tr_cool)/2)+237.3))))))-1)*1000-(0.622/((p_atm/(RH*611*EXP(17.27*(Tl_cool/(Tl_cool+237.3))))))-1)*1000))/(1005*(((Tv_cool+Tr_cool)/2)-Tl_cool))))*1.039+((-0.000729*$C35+0.001448)*(Tl_cool-((Tv_cool+Tr_cool)/2))+(0.016908*$C35-0.033574))*1.039>1,1,1/(1+((2258*((0.622/((p_atm/(1*611*EXP(17.27*(((Tv_cool+Tr_cool)/2)/(((Tv_cool+Tr_cool)/2)+237.3))))))-1)*1000-(0.622/((p_atm/(RH*611*EXP(17.27*(Tl_cool/(Tl_cool+237.3))))))-1)*1000))/(1005*(((Tv_cool+Tr_cool)/2)-Tl_cool))))*1.039+((-0.000729*$C35+0.001448)*(Tl_cool-((Tv_cool+Tr_cool)/2))+(0.016908*$C35-0.033574))*1.039))))*$H$14","v":{"v":425.28072036719897,"d":"425"}},{"$f":"ROUND(((H35/$H$14)/((Tr_cool-Tv_cool)*1.163))*$I$14,IF($W$4=1,0,IF($W$4=2,2)))","v":73},{"$f":"IF($AA$1=1,IF((POWER(((I35/$I$14)/1000)/$X$36,2)*100)*$J$14<0.01,0.01,(POWER(((I35/$I$14)/1000)/$X$36,2)*100)*$J$14),($Z$36*(I35/$I$14)^$Z$38)*$J$14)","v":{"v":0.33138216699846984,"d":"0.33"}},{"$f":"IF(AA35<28,\"<20\",L35-8)","v":{"v":25.700000000000003,"d":"25.7"}},{"$f":"IF(AA35<20,\"<20\",AA35)","v":33.7},{"$f":"AB35","v":2.8},{"$f":"AC35*$N$14","v":173},{"$f":"(Tl_heat+(($D35/$G$14)/(1006*$N35*$K$14)))*$M$14+$O$14","v":{"v":83.74341371389056,"d":"83.7"}},{"$f":"(Tl_cool-((G35/$G$14)/(1006*N35*$K$14)))*$M$14+$O$14","v":{"v":12.693529672683475,"d":"12.7"}},null,null,{"v":1,"d":"1.000"},{"$nulls":3},{"$f":"IF($W$16=1,AE35,IF($W$16=2,AL35,IF($W$16=3,AS35,IF($W$16=4,AZ35,IF($W$16=5,BG35,IF($W$16=6,BN35,IF($W$16=7,BU35,IF($W$16=8,CB35))))))))","v":0},{"$f":"IF($W$16=1,AF35,IF($W$16=2,AM35,IF($W$16=3,AT35,IF($W$16=4,BA35,IF($W$16=5,BH35,IF($W$16=6,BO35,IF($W$16=7,BV35,IF($W$16=8,CC35))))))))","v":"a"},{"$f":"IF($W$16=1,AG35,IF($W$16=2,AN35,IF($W$16=3,AU35,IF($W$16=4,BB35,IF($W$16=5,BI35,IF($W$16=6,BP35,IF($W$16=7,BW35,IF($W$16=8,CD35))))))))","v":0},{"$f":"IF($W$16=1,AH35,IF($W$16=2,AO35,IF($W$16=3,AV35,IF($W$16=4,BC35,IF($W$16=5,BJ35,IF($W$16=6,BQ35,IF($W$16=7,BX35,IF($W$16=8,CE35))))))))","v":"a"},{"$f":"IF($W$16=1,AI35,IF($W$16=2,AP35,IF($W$16=3,AW35,IF($W$16=4,BD35,IF($W$16=5,BK35,IF($W$16=6,BR35,IF($W$16=7,BY35,IF($W$16=8,CF35))))))))","v":33.7},{"$f":"IF($W$16=1,AJ35,IF($W$16=2,AQ35,IF($W$16=3,AX35,IF($W$16=4,BE35,IF($W$16=5,BL35,IF($W$16=6,BS35,IF($W$16=7,BZ35,IF($W$16=8,CG35))))))))","v":2.8},{"$f":"IF($W$16=1,AK35,IF($W$16=2,AR35,IF($W$16=3,AY35,IF($W$16=4,BF35,IF($W$16=5,BM35,IF($W$16=6,BT35,IF($W$16=7,CA35,IF($W$16=8,CH35))))))))","v":173},"c",0,"a",null,"a",{"v":21,"d":"21.0"},{"v":1.2,"d":"1.200"},43,7.6991717687673511E-4,"a",-1.0160190827721899E-3,"a",{"v":32,"d":"32.0"},2.1,60,null,"a",null,"a",33.7,2.8,173,null,"a",null,"a",33.7,2.5,89,null,"a",null,"a",{"v":33,"d":"33.0"},2.8,182,null,"a",null,"a",{"v":33,"d":"33.0"},2.7,126]
[null,{"v":0.4,"d":"40%"},4,{"$f":"(($W$35*$C36^4+$W$36*$C36^3+$W$37*$C36^2+$W$38*$C36+$W$39)*((((Tv_heat-Tr_heat)/LN((Tv_heat-Tl_heat)/(Tr_heat-Tl_heat)))/((75-65)/LN((75-20)/(65-20))))^1))*$D$14*$AA$11","v":{"v":4208.154813438636,"d":"4208"}},{"$f":"ROUND(((D36/$D$14)/((Tv_heat-Tr_heat)*1.163))*$E$14,IF($W$4=1,0,IF($W$4=2,2)))","v":145},{"$f":"IF($AA$1=1,IF((POWER(((E36/$I$14)/1000)/$X$36,2)*100)*$J$14<0.01,0.01,(POWER(((E36/$I$14)/1000)/$X$36,2)*100)*$J$14),($X$36*(E36/$E$14)^$X$38)*$F$14)","v":{"v":1.162926054531533,"d":"1.16"}},{"$f":"(($Y$35*$C36^4+$Y$36*$C36^3+$Y$37*$C36^2+$Y$38*$C36+$Y$39)*((((Tv_cool-Tr_cool)/LN((Tv_cool-Tl_cool)/(Tr_cool-Tl_cool)))/((16-18)/LN((16-27)/(18-27))))^S36))*$G$14*$AA$11","v":{"v":465.31120093510003,"d":"465"}},{"$f":"((G36/$G$14)/(IF((237.3*LN((RH*EXP(17.27*(Tl_cool/(Tl_cool+237.3))))))/(17.27-LN((RH*EXP(17.27*(Tl_cool/(Tl_cool+237.3))))))<((Tv_cool+Tr_cool)/2),1,IF(1/(1+((2258*((0.622/((p_atm/(1*611*EXP(17.27*(((Tv_cool+Tr_cool)/2)/(((Tv_cool+Tr_cool)/2)+237.3))))))-1)*1000-(0.622/((p_atm/(RH*611*EXP(17.27*(Tl_cool/(Tl_cool+237.3))))))-1)*1000))/(1005*(((Tv_cool+Tr_cool)/2)-Tl_cool))))*1.039+((-0.000729*$C36+0.001448)*(Tl_cool-((Tv_cool+Tr_cool)/2))+(0.016908*$C36-0.033574))*1.039>1,1,1/(1+((2258*((0.622/((p_atm/(1*611*EXP(17.27*(((Tv_cool+Tr_cool)/2)/(((Tv_cool+Tr_cool)/2)+237.3))))))-1)*1000-(0.622/((p_atm/(RH*611*EXP(17.27*(Tl_cool/(Tl_cool+237.3))))))-1)*1000))/(1005*(((Tv_cool+Tr_cool)/2)-Tl_cool))))*1.039+((-0.000729*$C36+0.001448)*(Tl_cool-((Tv_cool+Tr_cool)/2))+(0.016908*$C36-0.033574))*1.039))))*$H$14","v":{"v":465.31120093510003,"d":"465"}},{"$f":"ROUND(((H36/$H$14)/((Tr_cool-Tv_cool)*1.163))*$I$14,IF($W$4=1,0,IF($W$4=2,2)))","v":80},{"$f":"IF($AA$1=1,IF((POWER(((I36/$I$14)/1000)/$X$36,2)*100)*$J$14<0.01,0.01,(POWER(((I36/$I$14)/1000)/$X$36,2)*100)*$J$14),)","v":{"v":0,"d":"0.00"}},{"$f":"IF(AA36<28,\"<20\",L36-8)","v":30.5},{"$f":"IF(AA36<20,\"<20\",AA36)","v":38.5},5.5,268,{"$f":"(Tl_heat+(($D36/$G$14)/(1006*$N36*$K$14)))*$M$14+$O$14","v":{"v":66.66969339926595,"d":"66.7"}},{"$f":"(Tl_cool-((G36/$G$14)/(1006*N36*$K$14)))*$M$14+$O$14","v":{"v":14.839559843773792,"d":"14.8"}},null,null,{"v":1,"d":"1.000"},{"$nulls":3},1.5118660666407935,1.2932915211001514E-4,0.18632215403912855,1.2932915211001514E-4,38.5,5.5,268,"d",0,1.531456,null,{"$f":"AF36","v":1.531456},28.5,{"v":2.5,"d":"2.500"},71,-0.03115245801870625,0.9985033665845889,-1.6377226323009122E-3,0.9985033665845889,{"v":39,"d":"39.0"},3.8,176,1.5118660666407935,1.2932915211001514E-4,0.18632215403912855,1.2932915211001514E-4,38.5,5.5,268,1.426761087082444,1.2932915211001514E-4,0.21151846586988798,1.2932915211001514E-4,38.5,4.5,158,-1.7032731680051472,2.7169905751214276E-4,-0.3119332960261891,2.7169905751214276E-4,38.8,5.5,270,1.1344894569539592,1.2932915211001514E-4,-0.3378093390745308,2.7169905751214276E-4,38.8,5.2,228]
[null,{"v":0.6,"d":"60%"},6,{"$f":"(($W$35*$C37^4+$W$36*$C37^3+$W$37*$C37^2+$W$38*$C37+$W$39)*((((Tv_heat-Tr_heat)/LN((Tv_heat-Tl_heat)/(Tr_heat-Tl_heat)))/((75-65)/LN((75-20)/(65-20))))^1))*$D$14*$AA$11","v":{"v":4818.46485209771,"d":"4818"}},{"$f":"ROUND(((D37/$D$14)/((Tv_heat-Tr_heat)*1.163))*$E$14,IF($W$4=1,0,IF($W$4=2,2)))","v":166},{"v":1.4893854648207197,"d":"1.49"},{"$f":"(($Y$35*$C37^4+$Y$36*$C37^3+$Y$37*$C37^2+$Y$38*$C37+$Y$39)*((((Tv_cool-Tr_cool)/LN((Tv_cool-Tl_cool)/(Tr_cool-Tl_cool)))/((16-18)/LN((16-27)/(18-27))))^S37))*$G$14*$AA$11","v":{"v":521.7420939012173,"d":"522"}},{"$f":"((G37/$G$14)/(IF((237.3*LN((RH*EXP(17.27*(Tl_cool/(Tl_cool+237.3))))))/(17.27-LN((RH*EXP(17.27*(Tl_cool/(Tl_cool+237.3))))))<((Tv_cool+Tr_cool)/2),1,IF(1/(1+((2258*((0.622/((p_atm/(1*611*EXP(17.27*(((Tv_cool+Tr_cool)/2)/(((Tv_cool+Tr_cool)/2)+237.3))))))-1)*1000-(0.622/((p_atm/(RH*611*EXP(17.27*(Tl_cool/(Tl_cool+237.3))))))-1)*1000))/(1005*(((Tv_cool+Tr_cool)/2)-Tl_cool))))*1.039+((-0.000729*$C37+0.001448)*(Tl_cool-((Tv_cool+Tr_cool)/2))+(0.016908*$C37-0.033574))*1.039>1,1,1/(1+((2258*((0.622/((p_atm/(1*611*EXP(17.27*(((Tv_cool+Tr_cool)/2)/(((Tv_cool+Tr_cool)/2)+237.3))))))-1)*1000-(0.622/((p_atm/(RH*611*EXP(17.27*(Tl_cool/(Tl_cool+237.3))))))-1)*1000))/(1005*(((Tv_cool+Tr_cool)/2)-Tl_cool))))*1.039+((-0.000729*$C37+0.001448)*(Tl_cool-((Tv_cool+Tr_cool)/2))+(0.016908*$C37-0.033574))*1.039))))*$H$14","v":{"v":521.7420939012173,"d":"522"}},{"$f":"ROUND(((H37/$H$14)/((Tr_cool-Tv_cool)*1.163))*$I$14,IF($W$4=1,0,IF($W$4=2,2)))","v":90},{"v":0,"d":"0.00"},37.3,45.3,10.3,373,{"$f":"(Tl_heat+(($D37/$G$14)/(1006*$N37*$K$14)))*$M$14+$O$14","v":{"v":58.39528509815356,"d":"58.4"}},{"$f":"(Tl_cool-((G37/$G$14)/(1006*N37*$K$14)))*$M$14+$O$14","v":{"v":15.84256873134111,"d":"15.8"}},null,null,{"v":1,"d":"1.000"},{"$nulls":3},-6.7861908639932995,"b",-0.25188697625825573,"b",45.3,10.3,373,"e",0.388,"b",{"v":-3.5568,"d":"-3.6"},"b",{"v":36,"d":"36.0"},{"v":5.4,"d":"5.400"},131,-42.34888281500728,"b",-12.331668705017123,"b",45.5,8.2,299,-6.7861908639932995,"b",-0.25188697625825573,"b",45.3,10.3,373,-10.163656045029517,"b",-2.312432305732183,"b",45.3,{"v":9,"d":"9.0"},227,26.268050048769958,"b",5.571272065871202,"b",45.5,{"v":10,"d":"10.0"},360,-6.653151374936009,"b",6.50414727553332,"b",45.5,9.1,304]
[null,{"v":0.8,"d":"80%"},8,{"$f":"(($W$35*$C38^4+$W$36*$C38^3+$W$37*$C38^2+$W$38*$C38+$W$39)*((((Tv_heat-Tr_heat)/LN((Tv_heat-Tl_heat)/(Tr_heat-Tl_heat)))/((75-65)/LN((75-20)/(65-20))))^1))*$D$14*$AA$11","v":{"v":5630.971338663313,"d":"5631"}},{"$f":"ROUND(((D38/$D$14)/((Tv_heat-Tr_heat)*1.163))*$E$14,IF($W$4=1,0,IF($W$4=2,2)))","v":194},{"v":1.9808023009466225,"d":"1.98"},{"$f":"(($Y$35*$C38^4+$Y$36*$C38^3+$Y$37*$C38^2+$Y$38*$C38+$Y$39)*((((Tv_cool-Tr_cool)/LN((Tv_cool-Tl_cool)/(Tr_cool-Tl_cool)))/((16-18)/LN((16-27)/(18-27))))^S38))*$G$14*$AA$11","v":{"v":603.8147078539628,"d":"604"}},{"$f":"((G38/$G$14)/(IF((237.3*LN((RH*EXP(17.27*(Tl_cool/(Tl_cool+237.3))))))/(17.27-LN((RH*EXP(17.27*(Tl_cool/(Tl_cool+237.3))))))<((Tv_cool+Tr_cool)/2),1,IF(1/(1+((2258*((0.622/((p_atm/(1*611*EXP(17.27*(((Tv_cool+Tr_cool)/2)/(((Tv_cool+Tr_cool)/2)+237.3))))))-1)*1000-(0.622/((p_atm/(RH*611*EXP(17.27*(Tl_cool/(Tl_cool+237.3))))))-1)*1000))/(1005*(((Tv_cool+Tr_cool)/2)-Tl_cool))))*1.039+((-0.000729*$C38+0.001448)*(Tl_cool-((Tv_cool+Tr_cool)/2))+(0.016908*$C38-0.033574))*1.039>1,1,1/(1+((2258*((0.622/((p_atm/(1*611*EXP(17.27*(((Tv_cool+Tr_cool)/2)/(((Tv_cool+Tr_cool)/2)+237.3))))))-1)*1000-(0.622/((p_atm/(RH*611*EXP(17.27*(Tl_cool/(Tl_cool+237.3))))))-1)*1000))/(1005*(((Tv_cool+Tr_cool)/2)-Tl_cool))))*1.039+((-0.000729*$C38+0.001448)*(Tl_cool-((Tv_cool+Tr_cool)/2))+(0.016908*$C38-0.033574))*1.039))))*$H$14","v":{"v":603.8147078539628,"d":"604"}},{"$f":"ROUND(((H38/$H$14)/((Tr_cool-Tv_cool)*1.163))*$I$14,IF($W$4=1,0,IF($W$4=2,2)))","v":104},{"v":0,"d":"0.00"},{"v":43,"d":"43.0"},{"v":51,"d":"51.0"},18.5,466,{"$f":"(Tl_heat+(($D38/$G$14)/(1006*$N38*$K$14)))*$M$14+$O$14","v":{"v":55.914963818085226,"d":"55.9"}},{"$f":"(Tl_cool-((G38/$G$14)/(1006*N38*$K$14)))*$M$14+$O$14","v":{"v":16.14880238574423,"d":"16.1"}},null,null,{"v":1,"d":"1.000"},{"$nulls":3},199.5924373904281,1.829330158620641,15.664455358346679,1.829330158620641,51,18.5,466,"f",320.76,null,{"v":105.02,"d":"105.0"},{"$f":"AF38","v":0},44.5,{"v":9.1,"d":"9.100"},182,1409.4515830987593,{"$f":"AF38","v":0},329.74164387622085,2,{"v":52,"d":"52.0"},15.4,403,199.5924373904281,1.829330158620641,15.664455358346679,1.829330158620641,{"v":51,"d":"51.0"},18.5,466,191.91978998142477,1.829330158620641,34.90758347388724,1.829330158620641,{"v":51,"d":"51.0"},{"v":17,"d":"17.0"},289,398.10102592026755,1.815439154964933,34.97111415527813,1.815439154964933,50.8,{"v":18,"d":"18.0"},455,140.53405061422265,1.829330158620641,9.261657387934209,1.815439154964933,50.8,{"v":16,"d":"16.0"},393]
[null,{"v":1,"d":"100%"},10,{"$f":"(($W$35*$C39^4+$W$36*$C39^3+$W$37*$C39^2+$W$38*$C39+$W$39)*((((Tv_heat-Tr_heat)/LN((Tv_heat-Tl_heat)/(Tr_heat-Tl_heat)))/((75-65)/LN((75-20)/(65-20))))^1))*$D$14*$AA$11","v":{"v":6735.463665802251,"d":"6735"}},{"$f":"ROUND(((D39/$D$14)/((Tv_heat-Tr_heat)*1.163))*$E$14,IF($W$4=1,0,IF($W$4=2,2)))","v":232},{"v":2.7476090674788978,"d":"2.75"},{"$f":"(($Y$35*$C39^4+$Y$36*$C39^3+$Y$37*$C39^2+$Y$38*$C39+$Y$39)*((((Tv_cool-Tr_cool)/LN((Tv_cool-Tl_cool)/(Tr_cool-Tl_cool)))/((16-18)/LN((16-27)/(18-27))))^S39))*$G$14*$AA$11","v":{"v":720.7703513817482,"d":"721"}},{"$f":"((G39/$G$14)/(IF((237.3*LN((RH*EXP(17.27*(Tl_cool/(Tl_cool+237.3))))))/(17.27-LN((RH*EXP(17.27*(Tl_cool/(Tl_cool+237.3))))))<((Tv_cool+Tr_cool)/2),1,IF(1/(1+((2258*((0.622/((p_atm/(1*611*EXP(17.27*(((Tv_cool+Tr_cool)/2)/(((Tv_cool+Tr_cool)/2)+237.3))))))-1)*1000-(0.622/((p_atm/(RH*611*EXP(17.27*(Tl_cool/(Tl_cool+237.3))))))-1)*1000))/(1005*(((Tv_cool+Tr_cool)/2)-Tl_cool))))*1.039+((-0.000729*$C39+0.001448)*(Tl_cool-((Tv_cool+Tr_cool)/2))+(0.016908*$C39-0.033574))*1.039>1,1,1/(1+((2258*((0.622/((p_atm/(1*611*EXP(17.27*(((Tv_cool+Tr_cool)/2)/(((Tv_cool+Tr_cool)/2)+237.3))))))-1)*1000-(0.622/((p_atm/(RH*611*EXP(17.27*(Tl_cool/(Tl_cool+237.3))))))-1)*1000))/(1005*(((Tv_cool+Tr_cool)/2)-Tl_cool))))*1.039+((-0.000729*$C39+0.001448)*(Tl_cool-((Tv_cool+Tr_cool)/2))+(0.016908*$C39-0.033574))*1.039))))*$H$14","v":{"v":720.7703513817482,"d":"721"}},{"$f":"ROUND(((H39/$H$14)/((Tr_cool-Tv_cool)*1.163))*$I$14,IF($W$4=1,0,IF($W$4=2,2)))","v":124},{"v":0,"d":"0.00"},{"v":47,"d":"47.0"},{"v":55,"d":"55.0"},28.8,510,{"$f":"(Tl_heat+(($D39/$G$14)/(1006*$N39*$K$14)))*$M$14+$O$14","v":{"v":59.253225997555376,"d":"59.3"}},{"$f":"(Tl_cool-((G39/$G$14)/(1006*N39*$K$14)))*$M$14+$O$14","v":{"v":15.799463422425681,"d":"15.8"}},null,null,{"v":1,"d":"1.000"},{"$nulls":3},2614.564208983789,0,379.76208308685494,0,55,28.8,510,"g",110.2,null,{"v":-121.32,"d":"-121.3"},null,{"v":50,"d":"50.0"},{"v":14.1,"d":"14.100"},206,-1846.1341487293191,null,-496.28056416041005,null,{"v":57,"d":"57.0"},26.4,503,2614.564208983789,null,379.76208308685494,null,{"v":55,"d":"55.0"},28.8,510,2025.6470693484523,null,228.6064063053341,null,{"v":55,"d":"55.0"},28.8,382,3621.175588849903,null,500.42990714727654,null,54.5,28.8,531,1716.3174609491957,null,414.9879357173651,null,54.5,27.3,462]
[null,{"$f":"IF($S$7=1,NL!B40,IF(cal!$S$7=2,EN!B40,IF(cal!$S$7=3,DE!B40,IF(cal!$S$7=4,FR!B40,IF(cal!$S$7=5,NR!B40,IF(cal!$S$7=6,SP!B40,IF(cal!$S$7=7,SW!B40,IF(cal!$S$7=8,TS!B40,IF(cal!$S$7=9,RU!B40,IF(cal!$S$7=10,ExtraTaal2!B40,IF(cal!$S$7=11,ExtraTaal3!B40,)))))))))))","v":"*Звуковая мощность определена по ISO 3741:2010"},{"$f":"IF($S$7=1,NL!C40,IF(cal!$S$7=2,EN!C40,IF(cal!$S$7=3,DE!C40,IF(cal!$S$7=4,FR!C40,IF(cal!$S$7=5,NR!C40,IF(cal!$S$7=6,SP!C40,))))))","v":0},{"$f":"IF($S$7=1,NL!D40,IF(cal!$S$7=2,EN!D40,IF(cal!$S$7=3,DE!D40,IF(cal!$S$7=4,FR!D40,IF(cal!$S$7=5,NR!D40,IF(cal!$S$7=6,SP!D40,))))))","v":0},{"$f":"IF($S$7=1,NL!E40,IF(cal!$S$7=2,EN!E40,IF(cal!$S$7=3,DE!E40,IF(cal!$S$7=4,FR!E40,IF(cal!$S$7=5,NR!E40,IF(cal!$S$7=6,SP!E40,))))))","v":0},{"$f":"IF($S$7=1,NL!F40,IF(cal!$S$7=2,EN!F40,IF(cal!$S$7=3,DE!F40,IF(cal!$S$7=4,FR!F40,IF(cal!$S$7=5,NR!F40,IF(cal!$S$7=6,SP!F40,))))))","v":0},{"$f":"IF($S$7=1,NL!G40,IF(cal!$S$7=2,EN!G40,IF(cal!$S$7=3,DE!G40,IF(cal!$S$7=4,FR!G40,IF(cal!$S$7=5,NR!G40,IF(cal!$S$7=6,SP!G40,))))))","v":0},{"$f":"IF($S$7=1,NL!H40,IF(cal!$S$7=2,EN!H40,IF(cal!$S$7=3,DE!H40,IF(cal!$S$7=4,FR!H40,IF(cal!$S$7=5,NR!H40,IF(cal!$S$7=6,SP!H40,))))))","v":0},{"$f":"IF($S$7=1,NL!I40,IF(cal!$S$7=2,EN!I40,IF(cal!$S$7=3,DE!I40,IF(cal!$S$7=4,FR!I40,IF(cal!$S$7=5,NR!I40,IF(cal!$S$7=6,SP!I40,))))))","v":0},{"$f":"IF($S$7=1,NL!J40,IF(cal!$S$7=2,EN!J40,IF(cal!$S$7=3,DE!J40,IF(cal!$S$7=4,FR!J40,IF(cal!$S$7=5,NR!J40,IF(cal!$S$7=6,SP!J40,))))))","v":0},{"$f":"IF($S$7=1,NL!K40,IF(cal!$S$7=2,EN!K40,IF(cal!$S$7=3,DE!K40,IF(cal!$S$7=4,FR!K40,IF(cal!$S$7=5,NR!K40,IF(cal!$S$7=6,SP!K40,))))))","v":0},{"$f":"IF($S$7=1,NL!L40,IF(cal!$S$7=2,EN!L40,IF(cal!$S$7=3,DE!L40,IF(cal!$S$7=4,FR!L40,IF(cal!$S$7=5,NR!L40,IF(cal!$S$7=6,SP!L40,))))))","v":0},{"$f":"IF($S$7=1,NL!M40,IF(cal!$S$7=2,EN!M40,IF(cal!$S$7=3,DE!M40,IF(cal!$S$7=4,FR!M40,IF(cal!$S$7=5,NR!M40,IF(cal!$S$7=6,SP!M40,))))))","v":0},{"$f":"IF($S$7=1,NL!N40,IF(cal!$S$7=2,EN!N40,IF(cal!$S$7=3,DE!N40,IF(cal!$S$7=4,FR!N40,IF(cal!$S$7=5,NR!N40,IF(cal!$S$7=6,SP!N40,))))))","v":0},{"$f":"IF($S$7=1,NL!O40,IF(cal!$S$7=2,EN!O40,IF(cal!$S$7=3,DE!O40,IF(cal!$S$7=4,FR!O40,IF(cal!$S$7=5,NR!O40,IF(cal!$S$7=6,SP!O40,))))))","v":0},{"$f":"IF($S$7=1,NL!P40,IF(cal!$S$7=2,EN!P40,IF(cal!$S$7=3,DE!P40,IF(cal!$S$7=4,FR!P40,IF(cal!$S$7=5,NR!P40,IF(cal!$S$7=6,SP!P40,))))))","v":0},null,null,"n-value",{"$nulls":3},"H",{"$f":"IF($W$16=1,AF40,IF($W$16=2,AM40,IF($W$16=3,AT40,IF($W$16=4,BA40,IF($W$16=5,BH40,IF($W$16=6,BO40,IF($W$16=7,BV40,IF($W$16=8,CC40))))))))*IF($W$4=1,1,IF($W$4=2,1/2.54))","v":{"v":42,"d":"42.0"}},"B",{"$f":"IF($W$16=1,AH40,IF($W$16=2,AO40,IF($W$16=3,AV40,IF($W$16=4,BC40,IF($W$16=5,BJ40,IF($W$16=6,BQ40,IF($W$16=7,BX40,IF($W$16=8,CE40))))))))*IF($W$4=1,1,IF($W$4=2,1/2.54))","v":{"v":14,"d":"14.0"}},"L",{"$f":"IF($W$16=1,AJ40,IF($W$16=2,AQ40,IF($W$16=3,AX40,IF($W$16=4,BE40,IF($W$16=5,BL40,IF($W$16=6,BS40,IF($W$16=7,BZ40,IF($W$16=8,CG40))))))))*IF($W$4=1,1,IF($W$4=2,1/2.54))","v":{"v":145,"d":"145.0"}},null,null,"H",{"$f":"IF(AI1=AH2,AL4,AM4)","v":52.1},"B",{"$f":"IF(AI1=AH2,AL3,AM3)","v":8.5},"L",{"$f":"IF(AI1=AH2,AL8,AM8)","v":199},149,"H",{"$f":"IF(AI1=AH2,AN4,AO4)","v":55.8},"B",{"$f":"IF(AI1=AH2,AN3,AO3)","v":11},"L",{"$f":"IF(AI1=AH2,AN8,AO8)","v":190},null,"H",{"$f":"IF(AI1=AH2,AP4,AQ4)","v":42},"B",{"$f":"IF(AI1=AH2,AP3,AQ3)","v":14},"L",{"$f":"IF(AI1=AH2,AP8,AQ8)","v":145},null,"H",{"$f":"AT40","v":42},{"$f":"AU40","v":"B"},14,"L",145,null,"H",{"$f":"IF(AI1=AH3,AR4,AS4)","v":56},"B",{"$f":"IF(AI1=AH2,AR3,AS3)","v":14},"L",{"$f":"IF(AI1=AH2,AS8,AS8)","v":145},null,"H",{"$f":"BH40","v":56},{"$f":"BI40","v":"B"},14,"L",145]
[null,{"v":0.2,"d":"20%"},2,{"$f":"(($W$41*$C41^4+$W$42*$C41^3+$W$43*$C41^2+$W$44*$C41+$W$45)*((((Tv_heat-Tr_heat)/LN((Tv_heat-Tl_heat)/(Tr_heat-Tl_heat)))/((75-65)/LN((75-20)/(65-20))))^1))*$D$14*$AA$11","v":0},{"$f":"ROUND(((D41/$D$14)/((Tv_heat-Tr_heat)*1.163))*$E$14,IF($W$4=1,0,IF($W$4=2,2)))","v":0},{"$f":"($X$42*(E41/$E$14)^$X$44)*$F$14","v":{"$error":"#NUM!"}},{"$f":"(($Y$35*$C41^4+$Y$36*$C41^3+$Y$37*$C41^2+$Y$38*$C41+$Y$39)*((((Tv_cool-Tr_cool)/LN((Tv_cool-Tl_cool)/(Tr_cool-Tl_cool)))/((16-18)/LN((16-27)/(18-27))))^S41))*$G$14*$AA$11","v":{"v":425.28072036719897,"d":"425"}},{"$f":"((G41/$G$14)/(IF((237.3*LN((RH*EXP(17.27*(Tl_cool/(Tl_cool+237.3))))))/(17.27-LN((RH*EXP(17.27*(Tl_cool/(Tl_cool+237.3))))))<((Tv_cool+Tr_cool)/2),1,IF(1/(1+((2258*((0.622/((p_atm/(1*611*EXP(17.27*(((Tv_cool+Tr_cool)/2)/(((Tv_cool+Tr_cool)/2)+237.3))))))-1)*1000-(0.622/((p_atm/(RH*611*EXP(17.27*(Tl_cool/(Tl_cool+237.3))))))-1)*1000))/(1005*(((Tv_cool+Tr_cool)/2)-Tl_cool))))*1.039+((-0.000729*$C41+0.001448)*(Tl_cool-((Tv_cool+Tr_cool)/2))+(0.016908*$C41-0.033574))*1.039>1,1,1/(1+((2258*((0.622/((p_atm/(1*611*EXP(17.27*(((Tv_cool+Tr_cool)/2)/(((Tv_cool+Tr_cool)/2)+237.3))))))-1)*1000-(0.622/((p_atm/(RH*611*EXP(17.27*(Tl_cool/(Tl_cool+237.3))))))-1)*1000))/(1005*(((Tv_cool+Tr_cool)/2)-Tl_cool))))*1.039+((-0.000729*$C41+0.001448)*(Tl_cool-((Tv_cool+Tr_cool)/2))+(0.016908*$C41-0.033574))*1.039))))*$H$14","v":{"v":425.28072036719897,"d":"425"}},{"$f":"ROUND(((H41/$H$14)/((Tr_cool-Tv_cool)*1.163))*$I$14,IF($W$4=1,0,IF($W$4=2,2)))","v":73},{"$f":"($Z$36*(I41/$I$14)^$Z$38)*$J$14","v":{"v":0.33138216699846984,"d":"0.33"}},{"$f":"L41-8","v":{"v":-8,"d":"-8.0"}},{"$f":"AA41","v":{"v":0,"d":"0.0"}},{"$f":"AB41","v":{"v":0,"d":"0.0"}},{"$f":"AC41*$N$14","v":0},{"$f":"(Tl_heat+(($D41/$G$14)/(1006*$N41*$K$14)))*(0.05*$C41+0.7)*$M$14+$O$14","v":{"$error":"#DIV/0!"}},{"$f":"(Tl_cool-((G41/$G$14)/(1006*N41*$K$14)))*$M$14+$O$14","v":{"$error":"#DIV/0!"}},null,null,{"v":1,"d":"1.000"},{"$nulls":3},{"$f":"IF($W$16=1,AE41,IF($W$16=2,AL41,IF($W$16=3,AS41,IF($W$16=4,AZ41,IF($W$16=5,BG41,IF($W$16=6,BN41,IF($W$16=7,BU41,IF($W$16=8,CB41))))))))","v":0},{"$f":"IF($W$16=1,AF41,IF($W$16=2,AM41,IF($W$16=3,AT41,IF($W$16=4,BA41,IF($W$16=5,BH41,IF($W$16=6,BO41,IF($W$16=7,BV41,IF($W$16=8,CC41))))))))","v":0},{"$f":"IF($W$16=1,AG41,IF($W$16=2,AN41,IF($W$16=3,AU41,IF($W$16=4,BB41,IF($W$16=5,BI41,IF($W$16=6,BP41,IF($W$16=7,BW41,IF($W$16=8,CD41))))))))","v":0},{"$f":"IF($W$16=1,AH41,IF($W$16=2,AO41,IF($W$16=3,AV41,IF($W$16=4,BC41,IF($W$16=5,BJ41,IF($W$16=6,BQ41,IF($W$16=7,BX41,IF($W$16=8,CE41))))))))","v":0},{"$f":"IF($W$16=1,AI41,IF($W$16=2,AP41,IF($W$16=3,AW41,IF($W$16=4,BD41,IF($W$16=5,BK41,IF($W$16=6,BR41,IF($W$16=7,BY41,IF($W$16=8,CF41))))))))","v":0},{"$f":"IF($W$16=1,AJ41,IF($W$16=2,AQ41,IF($W$16=3,AX41,IF($W$16=4,BE41,IF($W$16=5,BL41,IF($W$16=6,BS41,IF($W$16=7,BZ41,IF($W$16=8,CG41))))))))","v":0},{"$f":"IF($W$16=1,AK41,IF($W$16=2,AR41,IF($W$16=3,AY41,IF($W$16=4,BF41,IF($W$16=5,BM41,IF($W$16=6,BT41,IF($W$16=7,CA41,IF($W$16=8,CH41))))))))","v":0},"c"]
[null,{"v":0.4,"d":"40%"},4,{"$f":"(($W$41*$C42^4+$W$42*$C42^3+$W$43*$C42^2+$W$44*$C42+$W$45)*((((Tv_heat-Tr_heat)/LN((Tv_heat-Tl_heat)/(Tr_heat-Tl_heat)))/((75-65)/LN((75-20)/(65-20))))^1))*$D$14*$AA$11","v":0},{"$f":"ROUND(((D42/$D$14)/((Tv_heat-Tr_heat)*1.163))*$E$14,IF($W$4=1,0,IF($W$4=2,2)))","v":0},{"$f":"($X$42*(E42/$E$14)^$X$44)*$F$14","v":{"$error":"#NUM!"}},{"$f":"(($Y$35*$C42^4+$Y$36*$C42^3+$Y$37*$C42^2+$Y$38*$C42+$Y$39)*((((Tv_cool-Tr_cool)/LN((Tv_cool-Tl_cool)/(Tr_cool-Tl_cool)))/((16-18)/LN((16-27)/(18-27))))^S42))*$G$14*$AA$11","v":{"v":465.31120093510003,"d":"465"}},{"$f":"((G42/$G$14)/(IF((237.3*LN((RH*EXP(17.27*(Tl_cool/(Tl_cool+237.3))))))/(17.27-LN((RH*EXP(17.27*(Tl_cool/(Tl_cool+237.3))))))<((Tv_cool+Tr_cool)/2),1,IF(1/(1+((2258*((0.622/((p_atm/(1*611*EXP(17.27*(((Tv_cool+Tr_cool)/2)/(((Tv_cool+Tr_cool)/2)+237.3))))))-1)*1000-(0.622/((p_atm/(RH*611*EXP(17.27*(Tl_cool/(Tl_cool+237.3))))))-1)*1000))/(1005*(((Tv_cool+Tr_cool)/2)-Tl_cool))))*1.039+((-0.000729*$C42+0.001448)*(Tl_cool-((Tv_cool+Tr_cool)/2))+(0.016908*$C42-0.033574))*1.039>1,1,1/(1+((2258*((0.622/((p_atm/(1*611*EXP(17.27*(((Tv_cool+Tr_cool)/2)/(((Tv_cool+Tr_cool)/2)+237.3))))))-1)*1000-(0.622/((p_atm/(RH*611*EXP(17.27*(Tl_cool/(Tl_cool+237.3))))))-1)*1000))/(1005*(((Tv_cool+Tr_cool)/2)-Tl_cool))))*1.039+((-0.000729*$C42+0.001448)*(Tl_cool-((Tv_cool+Tr_cool)/2))+(0.016908*$C42-0.033574))*1.039))))*$H$14","v":{"v":465.31120093510003,"d":"465"}},{"$f":"ROUND(((H42/$H$14)/((Tr_cool-Tv_cool)*1.163))*$I$14,IF($W$4=1,0,IF($W$4=2,2)))","v":80},{"$f":"($Z$36*(I42/$I$14)^$Z$38)*$J$14","v":{"v":0.39181074157209855,"d":"0.39"}},{"v":-8,"d":"-8.0"},{"v":0,"d":"0.0"},{"v":0,"d":"0.0"},0,{"$f":"(Tl_heat+(($D42/$G$14)/(1006*$N42*$K$14)))*(0.05*$C42+0.7)*$M$14+$O$14","v":{"$error":"#DIV/0!"}},{"$f":"(Tl_cool-((G42/$G$14)/(1006*N42*$K$14)))*$M$14+$O$14","v":{"$error":"#DIV/0!"}},null,null,{"v":1,"d":"1.000"},{"$nulls":3},0,0,0,0,0,0,0,"d"]
[null,{"v":0.6,"d":"60%"},6,{"$f":"(($W$41*$C43^4+$W$42*$C43^3+$W$43*$C43^2+$W$44*$C43+$W$45)*((((Tv_heat-Tr_heat)/LN((Tv_heat-Tl_heat)/(Tr_heat-Tl_heat)))/((75-65)/LN((75-20)/(65-20))))^1))*$D$14*$AA$11","v":0},{"$f":"ROUND(((D43/$D$14)/((Tv_heat-Tr_heat)*1.163))*$E$14,IF($W$4=1,0,IF($W$4=2,2)))","v":0},{"$error":"#NUM!"},{"$f":"(($Y$35*$C43^4+$Y$36*$C43^3+$Y$37*$C43^2+$Y$38*$C43+$Y$39)*((((Tv_cool-Tr_cool)/LN((Tv_cool-Tl_cool)/(Tr_cool-Tl_cool)))/((16-18)/LN((16-27)/(18-27))))^S43))*$G$14*$AA$11","v":{"v":521.7420939012173,"d":"522"}},{"$f":"((G43/$G$14)/(IF((237.3*LN((RH*EXP(17.27*(Tl_cool/(Tl_cool+237.3))))))/(17.27-LN((RH*EXP(17.27*(Tl_cool/(Tl_cool+237.3))))))<((Tv_cool+Tr_cool)/2),1,IF(1/(1+((2258*((0.622/((p_atm/(1*611*EXP(17.27*(((Tv_cool+Tr_cool)/2)/(((Tv_cool+Tr_cool)/2)+237.3))))))-1)*1000-(0.622/((p_atm/(RH*611*EXP(17.27*(Tl_cool/(Tl_cool+237.3))))))-1)*1000))/(1005*(((Tv_cool+Tr_cool)/2)-Tl_cool))))*1.039+((-0.000729*$C43+0.001448)*(Tl_cool-((Tv_cool+Tr_cool)/2))+(0.016908*$C43-0.033574))*1.039>1,1,1/(1+((2258*((0.622/((p_atm/(1*611*EXP(17.27*(((Tv_cool+Tr_cool)/2)/(((Tv_cool+Tr_cool)/2)+237.3))))))-1)*1000-(0.622/((p_atm/(RH*611*EXP(17.27*(Tl_cool/(Tl_cool+237.3))))))-1)*1000))/(1005*(((Tv_cool+Tr_cool)/2)-Tl_cool))))*1.039+((-0.000729*$C43+0.001448)*(Tl_cool-((Tv_cool+Tr_cool)/2))+(0.016908*$C43-0.033574))*1.039))))*$H$14","v":{"v":521.7420939012173,"d":"522"}},{"$f":"ROUND(((H43/$H$14)/((Tr_cool-Tv_cool)*1.163))*$I$14,IF($W$4=1,0,IF($W$4=2,2)))","v":90},{"v":0.4860166975417605,"d":"0.49"},{"v":-8,"d":"-8.0"},{"v":0,"d":"0.0"},{"v":0,"d":"0.0"},0,{"$f":"(Tl_heat+(($D43/$G$14)/(1006*$N43*$K$14)))*(0.05*$C43+0.7)*$M$14+$O$14","v":{"$error":"#DIV/0!"}},{"$f":"(Tl_cool-((G43/$G$14)/(1006*N43*$K$14)))*$M$14+$O$14","v":{"$error":"#DIV/0!"}},null,null,{"v":1,"d":"1.000"},{"$nulls":3},{"$f":"IF($W$16=1,AE43,IF($W$16=2,AL43,IF($W$16=3,AS43,IF($W$16=4,AZ43,IF($W$16=5,BG43,IF($W$16=6,BN43,IF($W$16=7,BU43,IF($W$16=8,CB43))))))))","v":0},0,0,0,0,0,0,"e"]
[null,{"v":0.8,"d":"80%"},8,{"$f":"(($W$41*$C44^4+$W$42*$C44^3+$W$43*$C44^2+$W$44*$C44+$W$45)*((((Tv_heat-Tr_heat)/LN((Tv_heat-Tl_heat)/(Tr_heat-Tl_heat)))/((75-65)/LN((75-20)/(65-20))))^1))*$D$14*$AA$11","v":0},{"$f":"ROUND(((D44/$D$14)/((Tv_heat-Tr_heat)*1.163))*$E$14,IF($W$4=1,0,IF($W$4=2,2)))","v":0},{"$error":"#NUM!"},{"$f":"(($Y$35*$C44^4+$Y$36*$C44^3+$Y$37*$C44^2+$Y$38*$C44+$Y$39)*((((Tv_cool-Tr_cool)/LN((Tv_cool-Tl_cool)/(Tr_cool-Tl_cool)))/((16-18)/LN((16-27)/(18-27))))^S44))*$G$14*$AA$11","v":{"v":603.8147078539628,"d":"604"}},{"$f":"((G44/$G$14)/(IF((237.3*LN((RH*EXP(17.27*(Tl_cool/(Tl_cool+237.3))))))/(17.27-LN((RH*EXP(17.27*(Tl_cool/(Tl_cool+237.3))))))<((Tv_cool+Tr_cool)/2),1,IF(1/(1+((2258*((0.622/((p_atm/(1*611*EXP(17.27*(((Tv_cool+Tr_cool)/2)/(((Tv_cool+Tr_cool)/2)+237.3))))))-1)*1000-(0.622/((p_atm/(RH*611*EXP(17.27*(Tl_cool/(Tl_cool+237.3))))))-1)*1000))/(1005*(((Tv_cool+Tr_cool)/2)-Tl_cool))))*1.039+((-0.000729*$C44+0.001448)*(Tl_cool-((Tv_cool+Tr_cool)/2))+(0.016908*$C44-0.033574))*1.039>1,1,1/(1+((2258*((0.622/((p_atm/(1*611*EXP(17.27*(((Tv_cool+Tr_cool)/2)/(((Tv_cool+Tr_cool)/2)+237.3))))))-1)*1000-(0.622/((p_atm/(RH*611*EXP(17.27*(Tl_cool/(Tl_cool+237.3))))))-1)*1000))/(1005*(((Tv_cool+Tr_cool)/2)-Tl_cool))))*1.039+((-0.000729*$C44+0.001448)*(Tl_cool-((Tv_cool+Tr_cool)/2))+(0.016908*$C44-0.033574))*1.039))))*$H$14","v":{"v":603.8147078539628,"d":"604"}},{"$f":"ROUND(((H44/$H$14)/((Tr_cool-Tv_cool)*1.163))*$I$14,IF($W$4=1,0,IF($W$4=2,2)))","v":104},{"v":0.6331641964775597,"d":"0.63"},{"v":-8,"d":"-8.0"},{"v":0,"d":"0.0"},{"v":0,"d":"0.0"},0,{"$f":"(Tl_heat+(($D44/$G$14)/(1006*$N44*$K$14)))*(0.05*$C44+0.7)*$M$14+$O$14","v":{"$error":"#DIV/0!"}},{"$f":"(Tl_cool-((G44/$G$14)/(1006*N44*$K$14)))*$M$14+$O$14","v":{"$error":"#DIV/0!"}},null,null,{"v":1,"d":"1.000"},{"$nulls":3},0,0,0,0,0,0,0,"f"]
[null,{"v":1,"d":"100%"},10,{"$f":"(($W$41*$C45^4+$W$42*$C45^3+$W$43*$C45^2+$W$44*$C45+$W$45)*((((Tv_heat-Tr_heat)/LN((Tv_heat-Tl_heat)/(Tr_heat-Tl_heat)))/((75-65)/LN((75-20)/(65-20))))^1))*$D$14*$AA$11","v":0},{"$f":"ROUND(((D45/$D$14)/((Tv_heat-Tr_heat)*1.163))*$E$14,IF($W$4=1,0,IF($W$4=2,2)))","v":0},{"$error":"#NUM!"},{"$f":"(($Y$35*$C45^4+$Y$36*$C45^3+$Y$37*$C45^2+$Y$38*$C45+$Y$39)*((((Tv_cool-Tr_cool)/LN((Tv_cool-Tl_cool)/(Tr_cool-Tl_cool)))/((16-18)/LN((16-27)/(18-27))))^S45))*$G$14*$AA$11","v":{"v":720.7703513817482,"d":"721"}},{"$f":"((G45/$G$14)/(IF((237.3*LN((RH*EXP(17.27*(Tl_cool/(Tl_cool+237.3))))))/(17.27-LN((RH*EXP(17.27*(Tl_cool/(Tl_cool+237.3))))))<((Tv_cool+Tr_cool)/2),1,IF(1/(1+((2258*((0.622/((p_atm/(1*611*EXP(17.27*(((Tv_cool+Tr_cool)/2)/(((Tv_cool+Tr_cool)/2)+237.3))))))-1)*1000-(0.622/((p_atm/(RH*611*EXP(17.27*(Tl_cool/(Tl_cool+237.3))))))-1)*1000))/(1005*(((Tv_cool+Tr_cool)/2)-Tl_cool))))*1.039+((-0.000729*$C45+0.001448)*(Tl_cool-((Tv_cool+Tr_cool)/2))+(0.016908*$C45-0.033574))*1.039>1,1,1/(1+((2258*((0.622/((p_atm/(1*611*EXP(17.27*(((Tv_cool+Tr_cool)/2)/(((Tv_cool+Tr_cool)/2)+237.3))))))-1)*1000-(0.622/((p_atm/(RH*611*EXP(17.27*(Tl_cool/(Tl_cool+237.3))))))-1)*1000))/(1005*(((Tv_cool+Tr_cool)/2)-Tl_cool))))*1.039+((-0.000729*$C45+0.001448)*(Tl_cool-((Tv_cool+Tr_cool)/2))+(0.016908*$C45-0.033574))*1.039))))*$H$14","v":{"v":720.7703513817482,"d":"721"}},{"$f":"ROUND(((H45/$H$14)/((Tr_cool-Tv_cool)*1.163))*$I$14,IF($W$4=1,0,IF($W$4=2,2)))","v":124},{"v":0.8734858090896757,"d":"0.87"},{"$error":"#VALUE!"},{"$f":"AA46","v":"L"},{"$f":"AB46","v":{"v":240,"d":"240.0"}},{"$f":"AC46*$N$14","v":0},{"$f":"(Tl_heat+(($D45/$G$14)/(1006*$N45*$K$14)))*(0.05*$C45+0.7)*$M$14+$O$14","v":{"$error":"#DIV/0!"}},{"$f":"(Tl_cool-((G45/$G$14)/(1006*N45*$K$14)))*$M$14+$O$14","v":{"$error":"#DIV/0!"}},null,null,{"v":1,"d":"1.000"},{"$nulls":3},0,0,0,0,0,0,0,"g"]
[null,{"$f":"IF($S$7=1,NL!B40,IF(cal!$S$7=2,EN!B40,IF(cal!$S$7=3,DE!B40,IF(cal!$S$7=4,FR!B40,IF(cal!$S$7=5,NR!B40,IF(cal!$S$7=6,SP!B40,IF(cal!$S$7=7,SW!B40,IF(cal!$S$7=8,TS!B40,IF(cal!$S$7=9,RU!B40,IF(cal!$S$7=10,ExtraTaal2!B40,IF(cal!$S$7=11,ExtraTaal3!B40,)))))))))))","v":"*Звуковая мощность определена по ISO 3741:2010"},{"$nulls":13},"v2023-10-02",{"$nulls":6},"H",{"$f":"IF($W$16=1,AF46,IF($W$16=2,AM46,IF($W$16=3,AT46,IF($W$16=4,BA46,IF($W$16=5,BH46,IF($W$16=6,BO46,IF($W$16=7,BV46,IF($W$16=8,CC46))))))))","v":{"v":41,"d":"41.0"}},"B",{"$f":"IF($W$16=1,AH46,IF($W$16=2,AO46,IF($W$16=3,AV46,IF($W$16=4,BC46,IF($W$16=5,BJ46,IF($W$16=6,BQ46,IF($W$16=7,BX46,IF($W$16=8,CE46))))))))","v":{"v":14,"d":"14.0"}},"L",{"v":240,"d":"240.0"},null,null,"H",52.1,"B",8.6,"L",{"v":198.7,"d":"199"},216,"H",{"$f":"55.8*IF($W$4=1,1,IF($W$4=2,1/2.54))","v":55.8},"B",10,"L",{"$f":"122*IF($W$4=1,1,IF($W$4=2,1/2.54))","v":122},null,"H",{"$f":"41*IF($W$4=1,1,IF($W$4=2,1/2.54))","v":41},"B",{"$f":"14*IF($W$4=1,1,IF($W$4=2,1/2.54))","v":14},"L",{"$f":"145*IF($W$4=1,1,IF($W$4=2,1/2.54))","v":145},null,"H",{"$f":"41*IF($W$4=1,1,IF($W$4=2,1/2.54))","v":41},"B",{"$f":"14*IF($W$4=1,1,IF($W$4=2,1/2.54))","v":14},"L",{"$f":"145*IF($W$4=1,1,IF($W$4=2,1/2.54))","v":145},null,"H",{"$f":"52*IF($W$4=1,1,IF($W$4=2,1/2.54))","v":52},"B",{"$f":"12*IF($W$4=1,1,IF($W$4=2,1/2.54))","v":12},"L",{"$f":"122*IF($W$4=1,1,IF($W$4=2,1/2.54))","v":122},null,"H",{"$f":"52*IF($W$4=1,1,IF($W$4=2,1/2.54))","v":52},"B",{"$f":"12*IF($W$4=1,1,IF($W$4=2,1/2.54))","v":12},"L",{"$f":"122*IF($W$4=1,1,IF($W$4=2,1/2.54))","v":122},null,"H",{"$f":"55*IF($W$4=1,1,IF($W$4=2,1/2.54))","v":55},"B",{"$f":"14*IF($W$4=1,1,IF($W$4=2,1/2.54))","v":14},"L",{"$f":"145*IF($W$4=1,1,IF($W$4=2,1/2.54))","v":145},null,"H",{"$f":"55*IF($W$4=1,1,IF($W$4=2,1/2.54))","v":55},"B",{"$f":"14*IF($W$4=1,1,IF($W$4=2,1/2.54))","v":14},"L",{"$f":"145*IF($W$4=1,1,IF($W$4=2,1/2.54))","v":145}]
[null,{"$f":"IF($S$7=1,NL!B41,IF(cal!$S$7=2,EN!B41,IF(cal!$S$7=3,DE!B41,IF(cal!$S$7=4,FR!B41,IF(cal!$S$7=5,NR!B41,IF(cal!$S$7=6,SP!B41,IF(cal!$S$7=7,SW!B41,IF(cal!$S$7=8,TS!B41,IF(cal!$S$7=9,RU!B41,IF(cal!$S$7=10,ExtraTaal2!B41,IF(cal!$S$7=11,ExtraTaal3!B41,)))))))))))","v":"***Уровень звукового давления (при постоянной помещения 8 дБ(A))"}]

{"sheet":"NL","index":2,"n_rows":41,"n_cols":20,"rows_kept":41,"hidden":true,"merged":[[3,7,3,10],[4,7,4,10],[8,1,8,3],[8,6,8,9],[8,12,8,13],[9,1,9,3],[9,6,9,9],[10,1,10,3],[10,6,10,9],[15,1,15,13],[21,1,21,13],[27,1,27,13],[33,1,33,13]]}
[]
[]
[null,"Invulformulier"]
[{"$nulls":7},"Hydraulisch mengsel:",0,0,0]
[null,"Randvoorwaarden",{"$nulls":5},"Toestel - Ventilator - Uitvoering:",0,0,0]
[]
[null,"Temperaturen",{"$nulls":14},"Kopieer alle data"]
[null,"Verwarmen:",{"$nulls":4},"Koelen:",{"$nulls":9},"SI-eenheden"]
[null,{"$f":"\"Water aanvoer\"","v":"Water aanvoer"},null,null,{"$f":"cal!E9","v":95},null,{"$f":"B9","v":"Water aanvoer"},{"$nulls":3},{"$f":"cal!K9","v":{"v":7.000000000000001,"d":"7"}},null,"Eenheidsstelsel",{"$nulls":3},"Imperiale-eenheden"]
[null,{"$f":"\"Water retour\"","v":"Water retour"},null,null,{"$f":"cal!E10","v":70},null,{"$f":"B10","v":"Water retour"},{"$nulls":3},{"$f":"cal!K10","v":12}]
[null,{"$f":"\"Ruimte\"","v":"Ruimte"},null,null,{"$f":"cal!E11","v":20},null,{"$f":"B11","v":"Ruimte"},{"$nulls":3},{"$f":"cal!K11","v":20}]
[{"$nulls":6},"Relatieve vochtigheid",{"$nulls":3},{"$f":"cal!K12","v":{"v":0.5,"d":"50%"}}]
[]
[]
[null,"Snelheidsniveau","Stuurspanning [V]",{"$f":"CONCATENATE(\"Warmteafgifte  \",ROUND(E9,0),\"/\",ROUND(E10,0),\"/\",ROUND(E11,0),\" [\"&IF(UnitsNo=1,\"W\",IF(UnitsNo=2,\"Btu/h\"))&\"]\")","v":"Warmteafgifte  95/70/20 [W]"},{"$f":"\"Waterdebiet, verwarming [\"&IF(UnitsNo=1,\"l/h\",IF(UnitsNo=2,\"GPM\"))&\"]\"","v":"Waterdebiet, verwarming [l/h]"},{"$f":"\"Waterzijdig drukverlies [\"&IF(UnitsNo=1,\"kPa\",IF(UnitsNo=2,\"inH2O\"))&\"]\"","v":"Waterzijdig drukverlies [kPa]"},{"$f":"CONCATENATE(\"Voelb. Koelcapaciteit  \",ROUND(K9,0),\"/\",,ROUND(K10,0),\"/\",,ROUND(K11,0),\" [\"&IF(UnitsNo=1,\"W\",IF(UnitsNo=2,\"Btu/h\"))&\"]\")","v":"Voelb. Koelcapaciteit  7/12/20 [W]"},{"$f":"CONCATENATE(\"Tot. koelcapaciteit \",,ROUND(K9,0),\"/\",,ROUND(K10,0),\"/\",,ROUND(K11,0),\" [\"&IF(UnitsNo=1,\"W\",IF(UnitsNo=2,\"Btu/h\"))&\"]\")","v":"Tot. koelcapaciteit 7/12/20 [W]"},{"$f":"\"Waterdebiet, koeling [\"&IF(UnitsNo=1,\"l/h\",IF(UnitsNo=2,\"GPM\"))&\"]\"","v":"Waterdebiet, koeling [l/h]"},{"$f":"\"Waterzijdig drukverlies [\"&IF(UnitsNo=1,\"kPa\",IF(UnitsNo=2,\"inH2O\"))&\"]\"","v":"Waterzijdig drukverlies [kPa]"},"Geluidsdruk ** [dB(A)]","Geluidsvermogen * [dB(A)]","Opgenomen elektr. vermogen [W]",{"$f":"\"Luchtdebiet [\"&IF(UnitsNo=1,\"m³/h\",IF(UnitsNo=2,\"CFM\"))&\"]\"","v":"Luchtdebiet [m³/h]"},{"$f":"\"Uitblaastemp. verwarming  [\"&IF(UnitsNo=1,\"°C\",IF(UnitsNo=2,\"°F\"))&\"]\"","v":"Uitblaastemp. verwarming  [°C]"},{"$f":"\"Uitblaastemp. koeling  [\"&IF(UnitsNo=1,\"°C\",IF(UnitsNo=2,\"°F\"))&\"]\"","v":"Uitblaastemp. koeling  [°C]"}]
[null,{"$f":"cal!$X$1&\" \"&$T$16&\" \"&ROUND(cal!X22,1)&IF(UnitsNo=1,\" cm\",IF(UnitsNo=2,\" in\"))& \" \"&$T$17&\" \"&ROUND(cal!Z22,1)&IF(UnitsNo=1,\" cm\",IF(UnitsNo=2,\" in\"))&\" \"&$T$18&\" \"&ROUND(cal!AB22,1)&IF(UnitsNo=1,\" cm\",IF(UnitsNo=2,\" in\"))&\" (Type 1)\"","v":"Briza Net Zero M H42 2P hoogte 42 cm breedte 14 cm lengte 75 cm (Type 1)"},{"$nulls":15},"Temp.",null,"hoogte"]
[{"$nulls":17},"verw.!",null,"breedte"]
[{"$nulls":17},"koelen!",null,"lengte"]
[]
[]
[]
[null,{"$f":"cal!$X$1&\" \"&$T$16&\" \"&ROUND(cal!X28,1)&IF(UnitsNo=1,\" cm\",IF(UnitsNo=2,\" in\"))& \" \"&$T$17&\" \"&ROUND(cal!Z28,1)&IF(UnitsNo=1,\" cm\",IF(UnitsNo=2,\" in\"))&\" \"&$T$18&\" \"&ROUND(cal!AB28,1)&IF(UnitsNo=1,\" cm\",IF(UnitsNo=2,\" in\"))&\" (Type 2)\"","v":"Briza Net Zero M H42 2P hoogte 42 cm breedte 14 cm lengte 95 cm (Type 2)"}]
[]
[]
[]
[]
[]
[null,{"$f":"cal!$X$1&\" \"&$T$16&\" \"&ROUND(cal!X34,1)&IF(UnitsNo=1,\" cm\",IF(UnitsNo=2,\" in\"))& \" \"&$T$17&\" \"&ROUND(cal!Z34,1)&IF(UnitsNo=1,\" cm\",IF(UnitsNo=2,\" in\"))&\" \"&$T$18&\" \"&ROUND(cal!AB34,1)&IF(UnitsNo=1,\" cm\",IF(UnitsNo=2,\" in\"))&\" (Type 3)\"","v":"Briza Net Zero M H42 2P hoogte 42 cm breedte 14 cm lengte 125 cm (Type 3)"}]
[]
[]
[]
[]
[]
[null,{"$f":"cal!$X$1&\" \"&$T$16&\" \"&ROUND(cal!X40,1)&IF(UnitsNo=1,\" cm\",IF(UnitsNo=2,\" in\"))& \" \"&$T$17&\" \"&ROUND(cal!Z40,1)&IF(UnitsNo=1,\" cm\",IF(UnitsNo=2,\" in\"))&\" \"&$T$18&\" \"&ROUND(cal!AB40,1)&IF(UnitsNo=1,\" cm\",IF(UnitsNo=2,\" in\"))&\" (Type 4)\"","v":"Briza Net Zero M H42 2P hoogte 42 cm breedte 14 cm lengte 145 cm (Type 4)"}]
[]
[]
[]
[]
[]
[null,"*Geluidsvermogen gemeten volgens ISO 3741:2010",{"$nulls":11},{"$f":"cal!P46","v":"v2023-10-02"}]
[null,"**Geluidsdruk bij een aangenomen ruimtedemping van 8 dB(A)"]

{"sheet":"EN","index":3,"n_rows":41,"n_cols":20,"rows_kept":41,"hidden":true,"merged":[[3,7,3,10],[4,7,4,10],[8,1,8,3],[8,6,8,9],[8,12,8,13],[9,1,9,3],[9,6,9,9],[10,6,10,9],[15,1,15,13],[21,1,21,13],[27,1,27,13],[33,1,33,13]]}
[]
[]
[null,"Formulary"]
[{"$nulls":7},"Hydraulic mix:",0,0,0]
[null,"Conditions",{"$nulls":5},"Device - Ventilator - Utilization:",0,0,0]
[]
[null,"Temperatures",{"$nulls":14},"Copy all data"]
[null,"Heating:",{"$nulls":4},"Cooling:",{"$nulls":9},"SI-units"]
[null,"Supply water",null,null,{"$f":"cal!E9","v":95},null,{"$f":"B9","v":"Supply water"},{"$nulls":3},{"$f":"cal!K9","v":{"v":7.000000000000001,"d":"7"}},null,"Unit conversion",{"$nulls":3},"Imperial-units"]
[null,"Return water",null,null,{"$f":"cal!E10","v":70},null,{"$f":"B10","v":"Return water"},{"$nulls":3},{"$f":"cal!K10","v":12}]
[null,"Entering air",null,null,{"$f":"cal!E11","v":20},null,{"$f":"B11","v":"Entering air"},{"$nulls":3},{"$f":"cal!K11","v":20}]
[{"$nulls":6},"Relative humidity",{"$nulls":3},{"$f":"cal!K12","v":{"v":0.5,"d":"50%"}}]
[]
[]
[null,"Speed level","Control voltage [V]",{"$f":"CONCATENATE(\"Heat output  \",ROUND(E9,0),\"/\",ROUND(E10,0),\"/\",ROUND(E11,0),\" [\"&IF(cal!$W$4=1,\"W\",IF(cal!$W$4=2,\"Btu/h\"))&\"]\")","v":"Heat output  95/70/20 [W]"},{"$f":"\"Water flowrate, heating [\"&IF(cal!$W$4=1,\"l/h\",IF(cal!$W$4=2,\"GPM\"))&\"]\"","v":"Water flowrate, heating [l/h]"},{"$f":"\"Watersided pressure loss [\"&IF(cal!$W$4=1,\"kPa\",IF(cal!$W$4=2,\"inH2O\"))&\"]\"","v":"Watersided pressure loss [kPa]"},{"$f":"CONCATENATE(\"Sens. cooling capacity  \",ROUND(K9,0),\"/\",ROUND(K10,0),\"/\",ROUND(K11,0),\" [\"&IF(cal!$W$4=1,\"W\",IF(cal!$W$4=2,\"Btu/h\"))&\"]\")","v":"Sens. cooling capacity  7/12/20 [W]"},{"$f":"CONCATENATE(\"Tot. cooling capacity \",ROUND(K9,0),\"/\",ROUND(K10,0),\"/\",ROUND(K11,0),\" [\"&IF(cal!$W$4=1,\"W\",IF(cal!$W$4=2,\"Btu/h\"))&\"]\")","v":"Tot. cooling capacity 7/12/20 [W]"},{"$f":"\"Water flowrate, cooling [\"&IF(cal!$W$4=1,\"l/h\",IF(cal!$W$4=2,\"GPM\"))&\"]\"","v":"Water flowrate, cooling [l/h]"},{"$f":"\"Watersided pressure loss [\"&IF(cal!$W$4=1,\"kPa\",IF(cal!$W$4=2,\"inH2O\"))&\"]\"","v":"Watersided pressure loss [kPa]"},"Sound pressure ** [dB(A)]","Sound power * [dB(A)]","Electrical power [W]",{"$f":"\"Air flowrate [\"&IF(cal!$W$4=1,\"m³/h\",IF(cal!$W$4=2,\"CFM\"))&\"]\"","v":"Air flowrate [m³/h]"},{"$f":"\"Air exhaust temp. heating  [\"&IF(cal!$W$4=1,\"°C\",IF(cal!$W$4=2,\"°F\"))&\"]\"","v":"Air exhaust temp. heating  [°C]"},{"$f":"\"Air exhaust temp. cooling  [\"&IF(cal!$W$4=1,\"°C\",IF(cal!$W$4=2,\"°F\"))&\"]\"","v":"Air exhaust temp. cooling  [°C]"}]
[null,{"$f":"cal!$X$1&\" \"&$T$16&\" \"&ROUND(cal!X22,1)&IF(UnitsNo=1,\" cm\",IF(UnitsNo=2,\" in\"))& \" \"&$T$17&\" \"&ROUND(cal!Z22,1)&IF(UnitsNo=1,\" cm\",IF(UnitsNo=2,\" in\"))&\" \"&$T$18&\" \"&ROUND(cal!AB22,1)&IF(UnitsNo=1,\" cm\",IF(UnitsNo=2,\" in\"))&\" (Type 1)\"","v":"Briza Net Zero M H42 2P height 42 cm width 14 cm length 75 cm (Type 1)"},{"$nulls":15},"Temp.",null,"height"]
[{"$nulls":17},"heating!",null,"width"]
[{"$nulls":17},"cooling!",null,"length"]
[]
[]
[]
[null,{"$f":"cal!$X$1&\" \"&$T$16&\" \"&ROUND(cal!X28,1)&IF(UnitsNo=1,\" cm\",IF(UnitsNo=2,\" in\"))& \" \"&$T$17&\" \"&ROUND(cal!Z28,1)&IF(UnitsNo=1,\" cm\",IF(UnitsNo=2,\" in\"))&\" \"&$T$18&\" \"&ROUND(cal!AB28,1)&IF(UnitsNo=1,\" cm\",IF(UnitsNo=2,\" in\"))&\" (Type 2)\"","v":"Briza Net Zero M H42 2P height 42 cm width 14 cm length 95 cm (Type 2)"}]
[]
[]
[]
[]
[]
[null,{"$f":"cal!$X$1&\" \"&$T$16&\" \"&ROUND(cal!X34,1)&IF(UnitsNo=1,\" cm\",IF(UnitsNo=2,\" in\"))& \" \"&$T$17&\" \"&ROUND(cal!Z34,1)&IF(UnitsNo=1,\" cm\",IF(UnitsNo=2,\" in\"))&\" \"&$T$18&\" \"&ROUND(cal!AB34,1)&IF(UnitsNo=1,\" cm\",IF(UnitsNo=2,\" in\"))&\" (Type 3)\"","v":"Briza Net Zero M H42 2P height 42 cm width 14 cm length 125 cm (Type 3)"}]
[]
[]
[]
[]
[]
[null,{"$f":"cal!$X$1&\" \"&$T$16&\" \"&ROUND(cal!X40,1)&IF(UnitsNo=1,\" cm\",IF(UnitsNo=2,\" in\"))& \" \"&$T$17&\" \"&ROUND(cal!Z40,1)&IF(UnitsNo=1,\" cm\",IF(UnitsNo=2,\" in\"))&\" \"&$T$18&\" \"&ROUND(cal!AB40,1)&IF(UnitsNo=1,\" cm\",IF(UnitsNo=2,\" in\"))&\" (Type 4)\"","v":"Briza Net Zero M H42 2P height 42 cm width 14 cm length 145 cm (Type 4)"}]
[]
[]
[]
[]
[]
[null,"*Sound power according to ISO 3741:2010",{"$nulls":11},{"$f":"cal!P46","v":"v2023-10-02"}]
[null,"**Sound pressure with an assumed room damping of 8dB(A)"]

{"sheet":"DE","index":4,"n_rows":41,"n_cols":20,"rows_kept":41,"hidden":true,"merged":[[3,7,3,10],[4,7,4,10],[8,1,8,3],[8,6,8,9],[8,12,8,13],[9,1,9,3],[9,6,9,9],[10,1,10,3],[10,6,10,9],[15,1,15,13],[21,1,21,13],[27,1,27,13],[33,1,33,13]]}
[]
[]
[null,"Eingabefelder"]
[{"$nulls":7},"Hydraulikgemisch:"]
[null,"Auslegungsrandbedingungen",{"$nulls":5},"Gerät - Lüfter - Ausfürhung:",0,0,0]
[]
[null,"Temperaturen",{"$nulls":14},"Kopieren Sie alle daten"]
[null,"Heizen:",{"$nulls":4},"Kühlen:",{"$nulls":9},"SI-einheiten"]
[null,{"$f":"\"Vorlauf wasser\"","v":"Vorlauf wasser"},null,null,{"$f":"cal!E9","v":95},null,{"$f":"B9","v":"Vorlauf wasser"},{"$nulls":3},{"$f":"cal!K9","v":{"v":7.000000000000001,"d":"7"}},null,"Einheiten",{"$nulls":3},"Imperiale-einheiten"]
[null,{"$f":"\"Rücklauf wasser\"","v":"Rücklauf wasser"},null,null,{"$f":"cal!E10","v":70},null,{"$f":"B10","v":"Rücklauf wasser"},{"$nulls":3},{"$f":"cal!K10","v":12}]
[null,{"$f":"\"Raum\"","v":"Raum"},null,null,{"$f":"cal!E11","v":20},null,{"$f":"B11","v":"Raum"},{"$nulls":3},{"$f":"cal!K11","v":20}]
[{"$nulls":6},"Relative Luftfeuchtigkeit",{"$nulls":3},{"$f":"cal!K12","v":{"v":0.5,"d":"50%"}}]
[]
[]
[null,"Drehzahlstufe","Regelspannung [V]",{"$f":"CONCATENATE(\"Wärmeleistung  \",ROUND(E9,0),\"/\",ROUND(E10,0),\"/\",ROUND(E11,0),\" [\"&IF(cal!$W$4=1,\"W\",IF(cal!$W$4=2,\"Btu/h\"))&\"]\")","v":"Wärmeleistung  95/70/20 [W]"},{"$f":"\"Heizmittelstrom [\"&IF(cal!$W$4=1,\"l/h\",IF(cal!$W$4=2,\"GPM\"))&\"]\"","v":"Heizmittelstrom [l/h]"},{"$f":"\"zug. wassers. Druckverlust [\"&IF(cal!$W$4=1,\"kPa\",IF(cal!$W$4=2,\"inH2O\"))&\"]\"","v":"zug. wassers. Druckverlust [kPa]"},{"$f":"CONCATENATE(\"Sens. Kälteleistung  \",ROUND(K9,0),\"/\",ROUND(K10,0),\"/\",ROUND(K11,0),\" [\"&IF(cal!$W$4=1,\"W\",IF(cal!$W$4=2,\"Btu/h\"))&\"]\")","v":"Sens. Kälteleistung  7/12/20 [W]"},{"$f":"CONCATENATE(\"Tot. Kälteleistung \",ROUND(K9,0),\"/\",ROUND(K10,0),\"/\",ROUND(K11,0),\" [\"&IF(cal!$W$4=1,\"W\",IF(cal!$W$4=2,\"Btu/h\"))&\"]\")","v":"Tot. Kälteleistung 7/12/20 [W]"},{"$f":"\"Kühlmittelstrom [\"&IF(cal!$W$4=1,\"l/h\",IF(cal!$W$4=2,\"GPM\"))&\"]\"","v":"Kühlmittelstrom [l/h]"},{"$f":"\"zug. wassers. Druckverlust [\"&IF(cal!$W$4=1,\"kPa\",IF(cal!$W$4=2,\"inH2O\"))&\"]\"","v":"zug. wassers. Druckverlust [kPa]"},"Schalldruckpegel ** [dB(A)]","Schallleistungspegel * [dB(A)]","Leistungsaufnahme [W]",{"$f":"\"Luftvolumenstrom [\"&IF(cal!$W$4=1,\"m³/h\",IF(cal!$W$4=2,\"CFM\"))&\"]\"","v":"Luftvolumenstrom [m³/h]"},{"$f":"\"Luftaustrittstemp. Heizung  [\"&IF(cal!$W$4=1,\"°C\",IF(cal!$W$4=2,\"°F\"))&\"]\"","v":"Luftaustrittstemp. Heizung  [°C]"},{"$f":"\"Luftaustrittstemp. Kühlung  [\"&IF(cal!$W$4=1,\"°C\",IF(cal!$W$4=2,\"°F\"))&\"]\"","v":"Luftaustrittstemp. Kühlung  [°C]"}]
[null,{"$f":"cal!$X$1&\" \"&$T$16&\" \"&ROUND(cal!X22,1)&IF(UnitsNo=1,\" cm\",IF(UnitsNo=2,\" in\"))& \" \"&$T$17&\" \"&ROUND(cal!Z22,1)&IF(UnitsNo=1,\" cm\",IF(UnitsNo=2,\" in\"))&\" \"&$T$18&\" \"&ROUND(cal!AB22,1)&IF(UnitsNo=1,\" cm\",IF(UnitsNo=2,\" in\"))&\" (Type 1)\"","v":"Briza Net Zero M H42 2P höhe 42 cm breite 14 cm länge 75 cm (Type 1)"},{"$nulls":15},"Temp.",null,"höhe"]
[{"$nulls":17},"heizen!",null,"breite"]
[{"$nulls":17},"kühlen!",null,"länge"]
[]
[]
[]
[null,{"$f":"cal!$X$1&\" \"&$T$16&\" \"&ROUND(cal!X28,1)&IF(UnitsNo=1,\" cm\",IF(UnitsNo=2,\" in\"))& \" \"&$T$17&\" \"&ROUND(cal!Z28,1)&IF(UnitsNo=1,\" cm\",IF(UnitsNo=2,\" in\"))&\" \"&$T$18&\" \"&ROUND(cal!AB28,1)&IF(UnitsNo=1,\" cm\",IF(UnitsNo=2,\" in\"))&\" (Type 2)\"","v":"Briza Net Zero M H42 2P höhe 42 cm breite 14 cm länge 95 cm (Type 2)"}]
[]
[]
[]
[]
[]
[null,{"$f":"cal!$X$1&\" \"&$T$16&\" \"&ROUND(cal!X34,1)&IF(UnitsNo=1,\" cm\",IF(UnitsNo=2,\" in\"))& \" \"&$T$17&\" \"&ROUND(cal!Z34,1)&IF(UnitsNo=1,\" cm\",IF(UnitsNo=2,\" in\"))&\" \"&$T$18&\" \"&ROUND(cal!AB34,1)&IF(UnitsNo=1,\" cm\",IF(UnitsNo=2,\" in\"))&\" (Type 3)\"","v":"Briza Net Zero M H42 2P höhe 42 cm breite 14 cm länge 125 cm (Type 3)"}]
[]
[]
[]
[]
[]
[null,{"$f":"cal!$X$1&\" \"&$T$16&\" \"&ROUND(cal!X40,1)&IF(UnitsNo=1,\" cm\",IF(UnitsNo=2,\" in\"))& \" \"&$T$17&\" \"&ROUND(cal!Z40,1)&IF(UnitsNo=1,\" cm\",IF(UnitsNo=2,\" in\"))&\" \"&$T$18&\" \"&ROUND(cal!AB40,1)&IF(UnitsNo=1,\" cm\",IF(UnitsNo=2,\" in\"))&\" (Type 4)\"","v":"Briza Net Zero M H42 2P höhe 42 cm breite 14 cm länge 145 cm (Type 4)"}]
[]
[]
[]
[]
[]
[null,"*Schallleistungspegel nach ISO 3741:2010"]
[null,"**Schalldruckpegel bei angenommener Raumdämpfung von 8dB(A)"]

{"sheet":"FR","index":5,"n_rows":41,"n_cols":20,"rows_kept":41,"hidden":true,"merged":[[3,7,3,10],[4,7,4,10],[8,1,8,3],[8,6,8,9],[8,12,8,13],[9,1,9,3],[9,6,9,9],[10,1,10,3],[10,6,10,9],[15,1,15,13],[21,1,21,13],[27,1,27,13],[33,1,33,13]]}
[]
[]
[null,"Formulaire"]
[{"$nulls":7},"Mélange hydraulique:"]
[null,"Conditions",{"$nulls":5},"Appareil - Ventilateur - Version:",0,0,0]
[]
[null,"Températures",{"$nulls":14},"Copier toutes des données"]
[null,"Chauffer:",{"$nulls":4},"Refroidir:",{"$nulls":9},"Unités-SI"]
[null,{"$f":"\"Entrée de l'eau\"","v":"Entrée de l'eau"},null,null,{"$f":"cal!E9","v":95},null,{"$f":"B9","v":"Entrée de l'eau"},{"$nulls":3},{"$f":"cal!K9","v":{"v":7.000000000000001,"d":"7"}},null,"Système unitaire",{"$nulls":3},"Unités-Impériales"]
[null,{"$f":"\"Retour de l'eau\"","v":"Retour de l'eau"},null,null,{"$f":"cal!E10","v":70},null,{"$f":"B10","v":"Retour de l'eau"},{"$nulls":3},{"$f":"cal!K10","v":12}]
[null,{"$f":"\"Ambiante\"","v":"Ambiante"},null,null,{"$f":"cal!E11","v":20},null,{"$f":"B11","v":"Ambiante"},{"$nulls":3},{"$f":"cal!K11","v":20}]
[{"$nulls":6},"Humidité relative",{"$nulls":3},{"$f":"cal!K12","v":{"v":0.5,"d":"50%"}}]
[]
[]
[null,"Niveau de vitesse","Voltage [V]",{"$f":"CONCATENATE(\"Puissance de cha.  \",ROUND(E9,0),\"/\",ROUND(E10,0),\"/\",ROUND(E11,0),\" [\"&IF(cal!$W$4=1,\"W\",IF(cal!$W$4=2,\"Btu/h\"))&\"]\")","v":"Puissance de cha.  95/70/20 [W]"},{"$f":"\"Débit d'eau, chauffer [\"&IF(cal!$W$4=1,\"l/h\",IF(cal!$W$4=2,\"GPM\"))&\"]\"","v":"Débit d'eau, chauffer [l/h]"},{"$f":"\"Perte de charge [\"&IF(cal!$W$4=1,\"kPa\",IF(cal!$W$4=2,\"inH2O\"))&\"]\"","v":"Perte de charge [kPa]"},{"$f":"CONCATENATE(\"Puissance sens. de refr.  \",ROUND(K9,0),\"/\",ROUND(K10,0),\"/\",ROUND(K11,0),\" [\"&IF(cal!$W$4=1,\"W\",IF(cal!$W$4=2,\"Btu/h\"))&\"]\")","v":"Puissance sens. de refr.  7/12/20 [W]"},{"$f":"CONCATENATE(\"Puissance tot. de refr. \",ROUND(K9,0),\"/\",ROUND(K10,0),\"/\",ROUND(K11,0),\" [\"&IF(cal!$W$4=1,\"W\",IF(cal!$W$4=2,\"Btu/h\"))&\"]\")","v":"Puissance tot. de refr. 7/12/20 [W]"},{"$f":"\"Débit d'eau, refroidir [\"&IF(cal!$W$4=1,\"l/h\",IF(cal!$W$4=2,\"GPM\"))&\"]\"","v":"Débit d'eau, refroidir [l/h]"},{"$f":"\"Perte de charge [\"&IF(cal!$W$4=1,\"kPa\",IF(cal!$W$4=2,\"inH2O\"))&\"]\"","v":"Perte de charge [kPa]"},"Pression sonore ** [dB(A)]","Puissance sonore * [dB(A)]","Puissance absorbée [W]",{"$f":"\"Débit d'air [\"&IF(cal!$W$4=1,\"m³/h\",IF(cal!$W$4=2,\"CFM\"))&\"]\"","v":"Débit d'air [m³/h]"},{"$f":"\"Temp. de la sortie d'air cha.  [\"&IF(cal!$W$4=1,\"°C\",IF(cal!$W$4=2,\"°F\"))&\"]\"","v":"Temp. de la sortie d'air cha.  [°C]"},{"$f":"\"Temp. de la sortie d'air refr.  [\"&IF(cal!$W$4=1,\"°C\",IF(cal!$W$4=2,\"°F\"))&\"]\"","v":"Temp. de la sortie d'air refr.  [°C]"}]
[null,{"$f":"cal!$X$1&\" \"&$T$16&\" \"&ROUND(cal!X22,1)&IF(UnitsNo=1,\" cm\",IF(UnitsNo=2,\" in\"))& \" \"&$T$17&\" \"&ROUND(cal!Z22,1)&IF(UnitsNo=1,\" cm\",IF(UnitsNo=2,\" in\"))&\" \"&$T$18&\" \"&ROUND(cal!AB22,1)&IF(UnitsNo=1,\" cm\",IF(UnitsNo=2,\" in\"))&\" (Type 1)\"","v":"Briza Net Zero M H42 2P hauteur 42 cm largeur 14 cm longueur 75 cm (Type 1)"},{"$nulls":15},"Temp.",null,"hauteur"]
[{"$nulls":17},"chauf.!",null,"largeur"]
[{"$nulls":17},"refr.!",null,"longueur"]
[]
[]
[]
[null,{"$f":"cal!$X$1&\" \"&$T$16&\" \"&ROUND(cal!X28,1)&IF(UnitsNo=1,\" cm\",IF(UnitsNo=2,\" in\"))& \" \"&$T$17&\" \"&ROUND(cal!Z28,1)&IF(UnitsNo=1,\" cm\",IF(UnitsNo=2,\" in\"))&\" \"&$T$18&\" \"&ROUND(cal!AB28,1)&IF(UnitsNo=1,\" cm\",IF(UnitsNo=2,\" in\"))&\" (Type 2)\"","v":"Briza Net Zero M H42 2P hauteur 42 cm largeur 14 cm longueur 95 cm (Type 2)"}]
[]
[]
[]
[]
[]
[null,{"$f":"cal!$X$1&\" \"&$T$16&\" \"&ROUND(cal!X34,1)&IF(UnitsNo=1,\" cm\",IF(UnitsNo=2,\" in\"))& \" \"&$T$17&\" \"&ROUND(cal!Z34,1)&IF(UnitsNo=1,\" cm\",IF(UnitsNo=2,\" in\"))&\" \"&$T$18&\" \"&ROUND(cal!AB34,1)&IF(UnitsNo=1,\" cm\",IF(UnitsNo=2,\" in\"))&\" (Type 3)\"","v":"Briza Net Zero M H42 2P hauteur 42 cm largeur 14 cm longueur 125 cm (Type 3)"}]
[]
[]
[]
[]
[]
[null,{"$f":"cal!$X$1&\" \"&$T$16&\" \"&ROUND(cal!X40,1)&IF(UnitsNo=1,\" cm\",IF(UnitsNo=2,\" in\"))& \" \"&$T$17&\" \"&ROUND(cal!Z40,1)&IF(UnitsNo=1,\" cm\",IF(UnitsNo=2,\" in\"))&\" \"&$T$18&\" \"&ROUND(cal!AB40,1)&IF(UnitsNo=1,\" cm\",IF(UnitsNo=2,\" in\"))&\" (Type 4)\"","v":"Briza Net Zero M H42 2P hauteur 42 cm largeur 14 cm longueur 145 cm (Type 4)"}]
[]
[]
[]
[]
[]
[null,"*Puissance sonore testé selon ISO 3741:2010",{"$nulls":11},{"$f":"cal!P46","v":"v2023-10-02"}]
[null,"**Pression sonore avec une atténuation ambiante du 8dB(A)"]

{"sheet":"NR","index":6,"n_rows":41,"n_cols":20,"rows_kept":41,"hidden":true,"merged":[[3,7,3,10],[4,7,4,10],[8,1,8,3],[8,6,8,9],[8,12,8,13],[9,1,9,3],[9,6,9,9],[10,1,10,3],[10,6,10,9],[11,6,11,9],[15,1,15,13],[21,1,21,13],[27,1,27,13],[33,1,33,13]]}
[]
[]
[null,"Modell"]
[{"$nulls":7},"Væske blanding:",0,0,0]
[null,"Conditions",{"$nulls":5},"Modell:",0,0,0]
[]
[null,"Temperaturer",{"$nulls":14},"Kopier alle data"]
[null,"Varme:",{"$nulls":4},"Kjøling:",{"$nulls":9},"SI-enheter"]
[null,"Tur vann",0,0,{"$f":"cal!E9","v":95},null,{"$f":"B9","v":"Tur vann"},{"$nulls":3},{"$f":"cal!K9","v":{"v":7.000000000000001,"d":"7"}},null,"Enhetssystem",{"$nulls":3},"Imperiale-enheter"]
[null,"Retur vann",0,0,{"$f":"cal!E10","v":70},null,{"$f":"B10","v":"Retur vann"},{"$nulls":3},{"$f":"cal!K10","v":12}]
[null,"Rom",0,0,{"$f":"cal!E11","v":20},null,{"$f":"B11","v":"Rom"},{"$nulls":3},{"$f":"cal!K11","v":20}]
[{"$nulls":6},"Relativ fuktighet",{"$nulls":3},{"$f":"cal!K12","v":{"v":0.5,"d":"50%"}}]
[]
[]
[null,"Hastighet","Styresignal [V]",{"$f":"CONCATENATE(\"Varme effekt \",ROUND(E9,0),\"/\",ROUND(E10,0),\"/\",ROUND(E11,0),\" [\"&IF(cal!$W$4=1,\"W\",IF(cal!$W$4=2,\"Btu/h\"))&\"]\")","v":"Varme effekt 95/70/20 [W]"},{"$f":"\"Vannmengde, varme [\"&IF(cal!$W$4=1,\"l/h\",IF(cal!$W$4=2,\"GPM\"))&\"]\"","v":"Vannmengde, varme [l/h]"},{"$f":"\"Trykktap [\"&IF(cal!$W$4=1,\"kPa\",IF(cal!$W$4=2,\"ftH2O\"))&\"]\"","v":"Trykktap [kPa]"},{"$f":"CONCATENATE(\"Sens. Kjøling effekt * \",ROUND(K9,0),\"/\",ROUND(K10,0),\"/\",ROUND(K11,0),\" [\"&IF(cal!$W$4=1,\"W\",IF(cal!$W$4=2,\"Btu/h\"))&\"]\")","v":"Sens. Kjøling effekt * 7/12/20 [W]"},{"$f":"CONCATENATE(\"Tot. Kjøle effekt \",ROUND(K9,0),\"/\",ROUND(K10,0),\"/\",ROUND(K11,0),\" [\"&IF(cal!$W$4=1,\"W\",IF(cal!$W$4=2,\"Btu/h\"))&\"]\")","v":"Tot. Kjøle effekt 7/12/20 [W]"},{"$f":"\"Vannmengde, kjøling [\"&IF(cal!$W$4=1,\"l/h\",IF(cal!$W$4=2,\"GPM\"))&\"]\"","v":"Vannmengde, kjøling [l/h]"},{"$f":"F15","v":"Trykktap [kPa]"},"Lydtrykk ** [dB(A)]","Lydeffekt * [dB(A)]","Elektrisk effekt [W]",{"$f":"\"Luftmengde [\"&IF(cal!$W$4=1,\"m³/h\",IF(cal!$W$4=2,\"CFM\"))&\"]\"","v":"Luftmengde [m³/h]"},{"$f":"\"Uitblaastemp. verwarming  [\"&IF(cal!$W$4=1,\"°C\",IF(cal!$W$4=2,\"°F\"))&\"]\"","v":"Uitblaastemp. verwarming  [°C]"},{"$f":"\"Uitblaastemp. koeling  [\"&IF(cal!$W$4=1,\"°C\",IF(cal!$W$4=2,\"°F\"))&\"]\"","v":"Uitblaastemp. koeling  [°C]"}]
[null,{"$f":"cal!$X$1&\" \"&$T$16&\" \"&ROUND(cal!X22,1)&IF(UnitsNo=1,\" cm\",IF(UnitsNo=2,\" in\"))& \" \"&$T$17&\" \"&ROUND(cal!Z22,1)&IF(UnitsNo=1,\" cm\",IF(UnitsNo=2,\" in\"))&\" \"&$T$18&\" \"&ROUND(cal!AB22,1)&IF(UnitsNo=1,\" cm\",IF(UnitsNo=2,\" in\"))&\" (Type 1)\"","v":"Briza Net Zero M H42 2P høyde 42 cm bredde 14 cm lengde 75 cm (Type 1)"},{"$nulls":15},"Temp.",null,"høyde"]
[{"$nulls":17},"varme!",null,"bredde"]
[{"$nulls":17},"kjøling!",null,"lengde"]
[]
[]
[]
[null,{"$f":"cal!$X$1&\" \"&$T$16&\" \"&ROUND(cal!X28,1)&IF(UnitsNo=1,\" cm\",IF(UnitsNo=2,\" in\"))& \" \"&$T$17&\" \"&ROUND(cal!Z28,1)&IF(UnitsNo=1,\" cm\",IF(UnitsNo=2,\" in\"))&\" \"&$T$18&\" \"&ROUND(cal!AB28,1)&IF(UnitsNo=1,\" cm\",IF(UnitsNo=2,\" in\"))&\" (Type 2)\"","v":"Briza Net Zero M H42 2P høyde 42 cm bredde 14 cm lengde 95 cm (Type 2)"}]
[]
[]
[]
[]
[]
[null,{"$f":"cal!$X$1&\" \"&$T$16&\" \"&ROUND(cal!X34,1)&IF(UnitsNo=1,\" cm\",IF(UnitsNo=2,\" in\"))& \" \"&$T$17&\" \"&ROUND(cal!Z34,1)&IF(UnitsNo=1,\" cm\",IF(UnitsNo=2,\" in\"))&\" \"&$T$18&\" \"&ROUND(cal!AB34,1)&IF(UnitsNo=1,\" cm\",IF(UnitsNo=2,\" in\"))&\" (Type 3)\"","v":"Briza Net Zero M H42 2P høyde 42 cm bredde 14 cm lengde 125 cm (Type 3)"}]
[]
[]
[]
[]
[]
[null,{"$f":"cal!$X$1&\" \"&$T$16&\" \"&ROUND(cal!X40,1)&IF(UnitsNo=1,\" cm\",IF(UnitsNo=2,\" in\"))& \" \"&$T$17&\" \"&ROUND(cal!Z40,1)&IF(UnitsNo=1,\" cm\",IF(UnitsNo=2,\" in\"))&\" \"&$T$18&\" \"&ROUND(cal!AB40,1)&IF(UnitsNo=1,\" cm\",IF(UnitsNo=2,\" in\"))&\" (Type 4)\"","v":"Briza Net Zero M H42 2P høyde 42 cm bredde 14 cm lengde 145 cm (Type 4)"}]
[]
[]
[]
[]
[]
[null,"**Sound power according to ISO 3741:2010",{"$nulls":11},{"$f":"cal!P46","v":"v2023-10-02"}]
[null,"***Sound pressure with an assumed room damping of 8dB(A)"]

{"sheet":"SP","index":7,"n_rows":41,"n_cols":20,"rows_kept":41,"hidden":true,"merged":[[3,7,3,10],[4,7,4,10],[8,1,8,3],[8,6,8,9],[8,12,8,13],[9,1,9,3],[9,6,9,9],[10,1,10,3],[10,6,10,9],[11,6,11,9],[15,1,15,13],[21,1,21,13],[27,1,27,13],[33,1,33,13]]}
[]
[]
[]
[]
[]
[]
[null,"Temperaturas",{"$nulls":14},"Copiar todos los datos"]
[null,"Calefacción:",{"$nulls":4},"Enfriamiento:",{"$nulls":9},"Unidades-SI"]
[null,"Agua impulsión",0,0,{"$f":"cal!E9","v":95},null,{"$f":"B9","v":"Agua impulsión"},{"$nulls":3},{"$f":"cal!K9","v":{"v":7.000000000000001,"d":"7"}},null,"Convers. de unidades",{"$nulls":3},"Unidades-Imperial"]
[null,"Agua retorno",0,0,{"$f":"cal!E10","v":70},null,{"$f":"B10","v":"Agua retorno"},{"$nulls":3},{"$f":"cal!K10","v":12}]
[null,"Ambiente",0,0,{"$f":"cal!E11","v":20},null,{"$f":"B11","v":"Ambiente"},{"$nulls":3},{"$f":"cal!K11","v":20}]
[{"$nulls":6},"Humedad relativa",{"$nulls":3},{"$f":"cal!K12","v":{"v":0.5,"d":"50%"}}]
[]
[]
[null,"Nivel de velocidad"," Voltaje control [V]",{"$f":"CONCATENATE(\"Emisión calefacción \",ROUND(E9,0),\"/\",ROUND(E10,0),\"/\",ROUND(E11,0),\" [\"&IF(UnitsNo=1,\"W\",IF(UnitsNo=2,\"Btu/h\"))&\"]\")","v":"Emisión calefacción 95/70/20 [W]"},{"$f":"\"Caudal de agua, calefacción [\"&IF(1=1,\"l/h\",IF(UnitsNo=2,\"GPM\"))&\"]\"","v":"Caudal de agua, calefacción [l/h]"},{"$f":"\"Pérdida de carga del agua [\"&IF(UnitsNo=1,\"kPa\",IF(UnitsNo=2,\"ftH2O\"))&\"]\"","v":"Pérdida de carga del agua [kPa]"},{"$f":"CONCATENATE(\"Emisión sensible Frío * \",ROUND(K9,0),\"/\",ROUND(K10,0),\"/\",ROUND(K11,0),\" [\"&IF(UnitsNo=1,\"W\",IF(UnitsNo=2,\"Btu/h\"))&\"]\")","v":"Emisión sensible Frío * 7/12/20 [W]"},{"$f":"CONCATENATE(\"Emisión total Frío \",ROUND(K9,0),\"/\",ROUND(K10,0),\"/\",ROUND(K11,0),\" [\"&IF(UnitsNo=1,\"W\",IF(UnitsNo=2,\"Btu/h\"))&\"]\")","v":"Emisión total Frío 7/12/20 [W]"},{"$f":"\"Caudal de agua, Frío [\"&IF(UnitsNo=1,\"l/h\",IF(UnitsNo=2,\"GPM\"))&\"]\"","v":"Caudal de agua, Frío [l/h]"},{"$f":"F15","v":"Pérdida de carga del agua [kPa]"},"Presión sonora ** [dB(A)]","Potencia sonora * [dB(A)]","Potencia eléctrica absorbida [W]",{"$f":"\"Caudal de aire [\"&IF(UnitsNo=1,\"m³/h\",IF(UnitsNo=2,\"CFM\"))&\"]\"","v":"Caudal de aire [m³/h]"},{"$f":"\"Temperatura salida de aire calefacción [\"&IF(UnitsNo=1,\"°C\",IF(UnitsNo=2,\"°F\"))&\"]\"","v":"Temperatura salida de aire calefacción [°C]"},{"$f":"\"Temperatura salida de aire refrigeración (bulbo seco) [\"&IF(UnitsNo=1,\"°C\",IF(UnitsNo=2,\"°F\"))&\"]\"","v":"Temperatura salida de aire refrigeración (bulbo seco) [°C]"}]
[null,{"$f":"cal!$X$1&\" \"&$T$16&\" \"&ROUND(cal!X22,1)&IF(UnitsNo=1,\" cm\",IF(UnitsNo=2,\" in\"))& \" \"&$T$17&\" \"&ROUND(cal!Z22,1)&IF(UnitsNo=1,\" cm\",IF(UnitsNo=2,\" in\"))&\" \"&$T$18&\" \"&ROUND(cal!AB22,1)&IF(UnitsNo=1,\" cm\",IF(UnitsNo=2,\" in\"))&\" (Type 1)\"","v":"Briza Net Zero M H42 2P altura 42 cm ancho 14 cm longitud 75 cm (Type 1)"},{"$nulls":15},"Temp.",null,"altura"]
[{"$nulls":17},"calefac.",null,"ancho"]
[{"$nulls":17},"enfria.",null,"longitud"]
[]
[]
[]
[null,{"$f":"cal!$X$1&\" \"&$T$16&\" \"&ROUND(cal!X28,1)&IF(UnitsNo=1,\" cm\",IF(UnitsNo=2,\" in\"))& \" \"&$T$17&\" \"&ROUND(cal!Z28,1)&IF(UnitsNo=1,\" cm\",IF(UnitsNo=2,\" in\"))&\" \"&$T$18&\" \"&ROUND(cal!AB28,1)&IF(UnitsNo=1,\" cm\",IF(UnitsNo=2,\" in\"))&\" (Type 2)\"","v":"Briza Net Zero M H42 2P altura 42 cm ancho 14 cm longitud 95 cm (Type 2)"}]
[]
[]
[]
[]
[]
[null,{"$f":"cal!$X$1&\" \"&$T$16&\" \"&ROUND(cal!X34,1)&IF(UnitsNo=1,\" cm\",IF(UnitsNo=2,\" in\"))& \" \"&$T$17&\" \"&ROUND(cal!Z34,1)&IF(UnitsNo=1,\" cm\",IF(UnitsNo=2,\" in\"))&\" \"&$T$18&\" \"&ROUND(cal!AB34,1)&IF(UnitsNo=1,\" cm\",IF(UnitsNo=2,\" in\"))&\" (Type 3)\"","v":"Briza Net Zero M H42 2P altura 42 cm ancho 14 cm longitud 125 cm (Type 3)"}]
[]
[]
[]
[]
[]
[null,{"$f":"cal!$X$1&\" \"&$T$16&\" \"&ROUND(cal!X40,1)&IF(UnitsNo=1,\" cm\",IF(UnitsNo=2,\" in\"))& \" \"&$T$17&\" \"&ROUND(cal!Z40,1)&IF(UnitsNo=1,\" cm\",IF(UnitsNo=2,\" in\"))&\" \"&$T$18&\" \"&ROUND(cal!AB40,1)&IF(UnitsNo=1,\" cm\",IF(UnitsNo=2,\" in\"))&\" (Type 4)\"","v":"Briza Net Zero M H42 2P altura 42 cm ancho 14 cm longitud 145 cm (Type 4)"}]
[]
[]
[]
[]
[]
[null,"**Potencia sonora de acuerdo a ISO 3741:2010",{"$nulls":11},{"$f":"cal!P46","v":"v2023-10-02"}]
[null,"***Presión sonora asumiendo una reducción de la estancia de  8dB(A)"]

{"sheet":"SW","index":8,"n_rows":41,"n_cols":20,"rows_kept":41,"hidden":true,"merged":[[3,7,3,10],[4,7,4,10],[8,1,8,3],[8,6,8,9],[8,12,8,13],[9,1,9,3],[9,6,9,9],[10,6,10,9],[15,1,15,13],[21,1,21,13],[27,1,27,13],[33,1,33,13]]}
[]
[]
[null,"Formulary"]
[{"$nulls":7},"Hydraulic mix:",0,0,0]
[null,"Conditions",{"$nulls":5},"Device - Ventilator - Utilization:",0,0,0]
[]
[null,"Temperaturer",{"$nulls":14},"Kopiera all data"]
[null,"Värme:",{"$nulls":4},"Kyla:",{"$nulls":9},"SI-enheter"]
[null,"Tillopp",null,null,{"$f":"cal!E9","v":95},null,{"$f":"B9","v":"Tillopp"},{"$nulls":3},{"$f":"cal!K9","v":{"v":7.000000000000001,"d":"7"}},null,"Enhetssystem",{"$nulls":3},"Imperiella-enheter"]
[null,"Retur",null,null,{"$f":"cal!E10","v":70},null,{"$f":"B10","v":"Retur"},{"$nulls":3},{"$f":"cal!K10","v":12}]
[null,"Rum (torr)",null,null,{"$f":"cal!E11","v":20},null,{"$f":"B11","v":"Rum (torr)"},{"$nulls":3},{"$f":"cal!K11","v":20}]
[{"$nulls":6},"rel. Fuktighet",{"$nulls":3},{"$f":"cal!K12","v":{"v":0.5,"d":"50%"}}]
[]
[]
[null,"Fläkthastighet","Spänning, Fläkt [V]",{"$f":"CONCATENATE(\"Värme effekt  \",ROUND(E9,0),\"/\",ROUND(E10,0),\"/\",ROUND(E11,0),\" [\"&IF(cal!$W$4=1,\"W\",IF(cal!$W$4=2,\"Btu/h\"))&\"]\")","v":"Värme effekt  95/70/20 [W]"},{"$f":"\"Vattenflöde, värme [\"&IF(cal!$W$4=1,\"l/h\",IF(cal!$W$4=2,\"GPM\"))&\"]\"","v":"Vattenflöde, värme [l/h]"},{"$f":"\"Tryckfall, vatten [\"&IF(cal!$W$4=1,\"kPa\",IF(cal!$W$4=2,\"inH2O\"))&\"]\"","v":"Tryckfall, vatten [kPa]"},{"$f":"CONCATENATE(\"Märkbar kylkapacitet  \",ROUND(K9,0),\"/\",ROUND(K10,0),\"/\",ROUND(K11,0),\" [\"&IF(cal!$W$4=1,\"W\",IF(cal!$W$4=2,\"Btu/h\"))&\"]\")","v":"Märkbar kylkapacitet  7/12/20 [W]"},{"$f":"CONCATENATE(\"Total kylkapacitet \",ROUND(K9,0),\"/\",ROUND(K10,0),\"/\",ROUND(K11,0),\" [\"&IF(cal!$W$4=1,\"W\",IF(cal!$W$4=2,\"Btu/h\"))&\"]\")","v":"Total kylkapacitet 7/12/20 [W]"},{"$f":"\"Vattenflöde, kyla [\"&IF(cal!$W$4=1,\"l/h\",IF(cal!$W$4=2,\"GPM\"))&\"]\"","v":"Vattenflöde, kyla [l/h]"},{"$f":"F15","v":"Tryckfall, vatten [kPa]"},"Ljudtryck ** [dB(A)]","Ljudeffekt * [dB(A)]","Effektförbrukning [W]",{"$f":"\"Luftflöde [\"&IF(cal!$W$4=1,\"m³/h\",IF(cal!$W$4=2,\"CFM\"))&\"]\"","v":"Luftflöde [m³/h]"},{"$f":"\"Luftavgassystemets värming  [\"&IF(cal!$W$4=1,\"°C\",IF(cal!$W$4=2,\"°F\"))&\"]\"","v":"Luftavgassystemets värming  [°C]"},{"$f":"\"Luftavgassystemets kylning  [\"&IF(cal!$W$4=1,\"°C\",IF(cal!$W$4=2,\"°F\"))&\"]\"","v":"Luftavgassystemets kylning  [°C]"}]
[null,{"$f":"cal!$X$1&\" \"&$T$16&\" \"&ROUND(cal!X22,1)&IF(UnitsNo=1,\" cm\",IF(UnitsNo=2,\" in\"))& \" \"&$T$17&\" \"&ROUND(cal!Z22,1)&IF(UnitsNo=1,\" cm\",IF(UnitsNo=2,\" in\"))&\" \"&$T$18&\" \"&ROUND(cal!AB22,1)&IF(UnitsNo=1,\" cm\",IF(UnitsNo=2,\" in\"))&\" (Typ 1)\"","v":"Briza Net Zero M H42 2P höjd 42 cm djup 14 cm längd 75 cm (Typ 1)"},{"$nulls":15},"Temp.",null,"höjd"]
[{"$nulls":17},"värme!",null,"djup"]
[{"$nulls":17},"kyla!",null,"längd"]
[]
[]
[]
[null,{"$f":"cal!$X$1&\" \"&$T$16&\" \"&ROUND(cal!X28,1)&IF(UnitsNo=1,\" cm\",IF(UnitsNo=2,\" in\"))& \" \"&$T$17&\" \"&ROUND(cal!Z28,1)&IF(UnitsNo=1,\" cm\",IF(UnitsNo=2,\" in\"))&\" \"&$T$18&\" \"&ROUND(cal!AB28,1)&IF(UnitsNo=1,\" cm\",IF(UnitsNo=2,\" in\"))&\" (Typ 2)\"","v":"Briza Net Zero M H42 2P höjd 42 cm djup 14 cm längd 95 cm (Typ 2)"}]
[]
[]
[]
[]
[]
[null,{"$f":"cal!$X$1&\" \"&$T$16&\" \"&ROUND(cal!X34,1)&IF(UnitsNo=1,\" cm\",IF(UnitsNo=2,\" in\"))& \" \"&$T$17&\" \"&ROUND(cal!Z34,1)&IF(UnitsNo=1,\" cm\",IF(UnitsNo=2,\" in\"))&\" \"&$T$18&\" \"&ROUND(cal!AB34,1)&IF(UnitsNo=1,\" cm\",IF(UnitsNo=2,\" in\"))&\" (Typ 3)\"","v":"Briza Net Zero M H42 2P höjd 42 cm djup 14 cm längd 125 cm (Typ 3)"}]
[]
[]
[]
[]
[]
[null,{"$f":"cal!$X$1&\" \"&$T$16&\" \"&ROUND(cal!X40,1)&IF(UnitsNo=1,\" cm\",IF(UnitsNo=2,\" in\"))& \" \"&$T$17&\" \"&ROUND(cal!Z40,1)&IF(UnitsNo=1,\" cm\",IF(UnitsNo=2,\" in\"))&\" \"&$T$18&\" \"&ROUND(cal!AB40,1)&IF(UnitsNo=1,\" cm\",IF(UnitsNo=2,\" in\"))&\" (Typ 4)\"","v":"Briza Net Zero M H42 2P höjd 42 cm djup 14 cm längd 145 cm (Typ 4)"}]
[]
[]
[]
[]
[]
[null,"*Ljudeffekt enligt ISO 3741: 2010",{"$nulls":11},{"$f":"cal!P46","v":"v2023-10-02"}]
[null,"**Ljudtryck med en antagen rumsdämpning på 8dB (A)"]

{"sheet":"TS","index":9,"n_rows":41,"n_cols":20,"rows_kept":41,"hidden":true,"merged":[[3,7,3,10],[4,7,4,10],[8,1,8,3],[8,6,8,9],[8,12,8,13],[9,1,9,3],[9,6,9,9],[10,1,10,3],[10,6,10,9],[15,1,15,13],[21,1,21,13],[27,1,27,13],[33,1,33,13]]}
[]
[]
[null,"Invulformulier"]
[{"$nulls":7},"Směs vody:",0,0,0]
[null,"Randvoorwaarden",{"$nulls":5},"Těleso - Ventilátor - Verze:",0,0,0]
[]
[null,"Teploty",{"$nulls":14},"Kopírovat všechna data"]
[null,"Topení:",{"$nulls":4},"Chlazení:",{"$nulls":9},"Mezinárodní (Sl)"]
[null,{"$f":"\"Voda na přívodu\"","v":"Voda na přívodu"},null,null,{"$f":"cal!E9","v":95},null,{"$f":"B9","v":"Voda na přívodu"},{"$nulls":3},{"$f":"cal!K9","v":{"v":7.000000000000001,"d":"7"}},null,"Převod jednotek",{"$nulls":3},"Imperiální"]
[null,{"$f":"\"Voda na zpátečce\"","v":"Voda na zpátečce"},null,null,{"$f":"cal!E10","v":70},null,{"$f":"B10","v":"Voda na zpátečce"},{"$nulls":3},{"$f":"cal!K10","v":12}]
[null,"\"Suchá\" teplota vzduchu",null,null,{"$f":"cal!E11","v":20},null,{"$f":"B11","v":"\"Suchá\" teplota vzduchu"},{"$nulls":3},{"$f":"cal!K11","v":20}]
[{"$nulls":6},"Relativní vlhkost",{"$nulls":3},{"$f":"cal!K12","v":{"v":0.5,"d":"50%"}}]
[]
[]
[null,"Rychlost","Ovládací napětí [V]",{"$f":"CONCATENATE(\"Výkon Topení  \",ROUND(E9,0),\"/\",ROUND(E10,0),\"/\",ROUND(E11,0),\" [\"&IF(UnitsNo=1,\"W\",IF(UnitsNo=2,\"Btu/h\"))&\"]\")","v":"Výkon Topení  95/70/20 [W]"},{"$f":"\"Průtok vody, topení [\"&IF(UnitsNo=1,\"l/h\",IF(UnitsNo=2,\"GPM\"))&\"]\"","v":"Průtok vody, topení [l/h]"},{"$f":"\"Tlaková ztráta [\"&IF(UnitsNo=1,\"kPa\",IF(UnitsNo=2,\"inH2O\"))&\"]\"","v":"Tlaková ztráta [kPa]"},{"$f":"CONCATENATE(\"Výkon chlazení Znatelný  \",ROUND(K9,0),\"/\",,ROUND(K10,0),\"/\",,ROUND(K11,0),\" [\"&IF(UnitsNo=1,\"W\",IF(UnitsNo=2,\"Btu/h\"))&\"]\")","v":"Výkon chlazení Znatelný  7/12/20 [W]"},{"$f":"CONCATENATE(\"Výkon chlazení Celkový \",,ROUND(K9,0),\"/\",,ROUND(K10,0),\"/\",,ROUND(K11,0),\" [\"&IF(UnitsNo=1,\"W\",IF(UnitsNo=2,\"Btu/h\"))&\"]\")","v":"Výkon chlazení Celkový 7/12/20 [W]"},{"$f":"\"Průtok vody, chlazení [\"&IF(UnitsNo=1,\"l/h\",IF(UnitsNo=2,\"GPM\"))&\"]\"","v":"Průtok vody, chlazení [l/h]"},{"$f":"F15","v":"Tlaková ztráta [kPa]"},"Akustický tlak ** [dB(A)]","Akustický výkon * [dB(A)]","Elektrický výkon [W]",{"$f":"\"Průtok vzduchu [\"&IF(UnitsNo=1,\"m³/h\",IF(UnitsNo=2,\"CFM\"))&\"]\"","v":"Průtok vzduchu [m³/h]"},{"$f":"\"Výfuková teplota vzduchu top. [\"&IF(UnitsNo=1,\"°C\",IF(UnitsNo=2,\"°F\"))&\"]\"","v":"Výfuková teplota vzduchu top. [°C]"},{"$f":"\"Výfuková teplota vzduchu chlaz.  [\"&IF(UnitsNo=1,\"°C\",IF(UnitsNo=2,\"°F\"))&\"]\"","v":"Výfuková teplota vzduchu chlaz.  [°C]"}]
[null,{"$f":"cal!$X$1&\" \"&$T$16&\", \"&ROUND(cal!X22,1)&IF(UnitsNo=1,\" cm\",IF(UnitsNo=2,\" in\"))& \", \"&$T$17&\" \"&ROUND(cal!Z22,1)&IF(UnitsNo=1,\" cm\",IF(UnitsNo=2,\" in\"))&\", \"&$T$18&\" \"&ROUND(cal!AB22,1)&IF(UnitsNo=1,\" cm\",IF(UnitsNo=2,\" in\"))&\" (Typ 1)\"","v":"Briza Net Zero M H42 2P Výška, 42 cm, Šířka 14 cm, Délka 75 cm (Typ 1)"},{"$nulls":15},"Teploty",null,"Výška"]
[{"$nulls":17},"topení!",null,"Šířka"]
[{"$nulls":17},"chlazení!",null,"Délka"]
[]
[]
[]
[null,{"$f":"cal!$X$1&\" \"&$T$16&\" \"&ROUND(cal!X28,1)&IF(UnitsNo=1,\" cm\",IF(UnitsNo=2,\" in\"))& \" \"&$T$17&\" \"&ROUND(cal!Z28,1)&IF(UnitsNo=1,\" cm\",IF(UnitsNo=2,\" in\"))&\" \"&$T$18&\" \"&ROUND(cal!AB28,1)&IF(UnitsNo=1,\" cm\",IF(UnitsNo=2,\" in\"))&\" (Typ 2)\"","v":"Briza Net Zero M H42 2P Výška 42 cm Šířka 14 cm Délka 95 cm (Typ 2)"}]
[]
[]
[]
[]
[]
[null,{"$f":"cal!$X$1&\" \"&$T$16&\" \"&ROUND(cal!X34,1)&IF(UnitsNo=1,\" cm\",IF(UnitsNo=2,\" in\"))& \" \"&$T$17&\" \"&ROUND(cal!Z34,1)&IF(UnitsNo=1,\" cm\",IF(UnitsNo=2,\" in\"))&\" \"&$T$18&\" \"&ROUND(cal!AB34,1)&IF(UnitsNo=1,\" cm\",IF(UnitsNo=2,\" in\"))&\" (Typ 3)\"","v":"Briza Net Zero M H42 2P Výška 42 cm Šířka 14 cm Délka 125 cm (Typ 3)"}]
[]
[]
[]
[]
[]
[null,{"$f":"cal!$X$1&\" \"&$T$16&\" \"&ROUND(cal!X40,1)&IF(UnitsNo=1,\" cm\",IF(UnitsNo=2,\" in\"))& \" \"&$T$17&\" \"&ROUND(cal!Z40,1)&IF(UnitsNo=1,\" cm\",IF(UnitsNo=2,\" in\"))&\" \"&$T$18&\" \"&ROUND(cal!AB40,1)&IF(UnitsNo=1,\" cm\",IF(UnitsNo=2,\" in\"))&\" (Typ 4)\"","v":"Briza Net Zero M H42 2P Výška 42 cm Šířka 14 cm Délka 145 cm (Typ 4)"}]
[]
[]
[]
[]
[]
[null,"*Akustický tlak podle ISO 3741:2010 ",{"$nulls":11},{"$f":"cal!P46","v":"v2023-10-02"}]
[null,"**Akustický výkon s předpokládaným útlumem místnosti 8 dB (A)."]

{"sheet":"RU","index":10,"n_rows":41,"n_cols":20,"rows_kept":41,"hidden":true,"merged":[[3,7,3,10],[4,7,4,10],[8,1,8,3],[8,6,8,9],[8,12,8,13],[9,1,9,3],[9,6,9,9],[10,6,10,9],[15,1,15,13],[21,1,21,13],[27,1,27,13],[33,1,33,13]]}
[]
[]
[null,"Formulary"]
[{"$nulls":7},"Hydraulic mix:",0,0,0]
[null,"Conditions",{"$nulls":5},"Device - Ventilator - Utilization:",0,0,0]
[]
[null,"Температура",{"$nulls":14},"Скопировать подбор"]
[null,"Обогрев:",{"$nulls":4},"Охлаждение:",{"$nulls":9},"Система СИ"]
[null,"Темп.подачи",null,null,{"$f":"cal!E9","v":95},null,{"$f":"B9","v":"Темп.подачи"},{"$nulls":3},{"$f":"cal!K9","v":{"v":7.000000000000001,"d":"7"}},null,"Единицы измерения",{"$nulls":3},"Английская система мер"]
[null,"Темп.обратная",null,null,{"$f":"cal!E10","v":70},null,{"$f":"B10","v":"Темп.обратная"},{"$nulls":3},{"$f":"cal!K10","v":12}]
[null,"Темп.воздуха",null,null,{"$f":"cal!E11","v":20},null,{"$f":"B11","v":"Темп.воздуха"},{"$nulls":3},{"$f":"cal!K11","v":20}]
[{"$nulls":6},"Влажность",{"$nulls":3},{"$f":"cal!K12","v":{"v":0.5,"d":"50%"}}]
[]
[]
[null,"Скорость вентилятора","Управляющий сигнал [V]",{"$f":"CONCATENATE(\"Мощность отпление \",ROUND(E9,0),\"/\",ROUND(E10,0),\"/\",ROUND(E11,0),\" [\"&IF(cal!$W$4=1,\"W\",IF(cal!$W$4=2,\"Btu/h\"))&\"]\")","v":"Мощность отпление 95/70/20 [W]"},{"$f":"\"Расход теплоносителя, отопление [\"&IF(cal!$W$4=1,\"l/h\",IF(cal!$W$4=2,\"GPM\"))&\"]\"","v":"Расход теплоносителя, отопление [l/h]"},{"$f":"\"Потери давления жидкости [\"&IF(cal!$W$4=1,\"kPa\",IF(cal!$W$4=2,\"inH2O\"))&\"]\"","v":"Потери давления жидкости [kPa]"},{"$f":"CONCATENATE(\"Ощущ. мощность, охлаждение \",ROUND(K9,0),\"/\",ROUND(K10,0),\"/\",ROUND(K11,0),\" [\"&IF(cal!$W$4=1,\"W\",IF(cal!$W$4=2,\"Btu/h\"))&\"]\")","v":"Ощущ. мощность, охлаждение 7/12/20 [W]"},{"$f":"CONCATENATE(\"Общая мощность , охлаждение \",ROUND(K9,0),\"/\",ROUND(K10,0),\"/\",ROUND(K11,0),\" [\"&IF(cal!$W$4=1,\"W\",IF(cal!$W$4=2,\"Btu/h\"))&\"]\")","v":"Общая мощность , охлаждение 7/12/20 [W]"},{"$f":"\"Расход теплоносителя, охлаждение [\"&IF(cal!$W$4=1,\"l/h\",IF(cal!$W$4=2,\"GPM\"))&\"]\"","v":"Расход теплоносителя, охлаждение [l/h]"},{"$f":"\"Потери давления жидкости [\"&IF(cal!$W$4=1,\"kPa\",IF(cal!$W$4=2,\"inH2O\"))&\"]\"","v":"Потери давления жидкости [kPa]"},"Звуковое давление ** [dB(A)]","Звуковая мощность * [dB(A)]","Потребляемая мощность [W]",{"$f":"\"Расход воздуха [\"&IF(cal!$W$4=1,\"m³/h\",IF(cal!$W$4=2,\"CFM\"))&\"]\"","v":"Расход воздуха [m³/h]"},{"$f":"\"Темп. воздуха на выходе. отопление  [\"&IF(cal!$W$4=1,\"°C\",IF(cal!$W$4=2,\"°F\"))&\"]\"","v":"Темп. воздуха на выходе. отопление  [°C]"},{"$f":"\"Темп.воздуха на выходе. охлаждение  [\"&IF(cal!$W$4=1,\"°C\",IF(cal!$W$4=2,\"°F\"))&\"]\"","v":"Темп.воздуха на выходе. охлаждение  [°C]"}]
[null,{"$f":"cal!$X$1&\" \"&$T$16&\" \"&ROUND(cal!X22,1)&IF(UnitsNo=1,\" cm\",IF(UnitsNo=2,\" in\"))& \" \"&$T$17&\" \"&ROUND(cal!Z22,1)&IF(UnitsNo=1,\" cm\",IF(UnitsNo=2,\" in\"))&\" \"&$T$18&\" \"&ROUND(cal!AB22,1)&IF(UnitsNo=1,\" cm\",IF(UnitsNo=2,\" in\"))&\" (Тип 1)\"","v":"Briza Net Zero M H42 2P Высота 42 cm Ширина 14 cm Длина 75 cm (Тип 1)"},{"$nulls":15},"Темп.",null,"Высота"]
[{"$nulls":17},"Обогрев!",null,"Ширина"]
[{"$nulls":17},"Охлаждение!",null,"Длина"]
[]
[]
[]
[null,{"$f":"cal!$X$1&\" \"&$T$16&\" \"&ROUND(cal!X28,1)&IF(UnitsNo=1,\" cm\",IF(UnitsNo=2,\" in\"))& \" \"&$T$17&\" \"&ROUND(cal!Z28,1)&IF(UnitsNo=1,\" cm\",IF(UnitsNo=2,\" in\"))&\" \"&$T$18&\" \"&ROUND(cal!AB28,1)&IF(UnitsNo=1,\" cm\",IF(UnitsNo=2,\" in\"))&\" (Тип 2)\"","v":"Briza Net Zero M H42 2P Высота 42 cm Ширина 14 cm Длина 95 cm (Тип 2)"}]
[]
[]
[]
[]
[]
[null,{"$f":"cal!$X$1&\" \"&$T$16&\" \"&ROUND(cal!X34,1)&IF(UnitsNo=1,\" cm\",IF(UnitsNo=2,\" in\"))& \" \"&$T$17&\" \"&ROUND(cal!Z34,1)&IF(UnitsNo=1,\" cm\",IF(UnitsNo=2,\" in\"))&\" \"&$T$18&\" \"&ROUND(cal!AB34,1)&IF(UnitsNo=1,\" cm\",IF(UnitsNo=2,\" in\"))&\" (Тип 3)\"","v":"Briza Net Zero M H42 2P Высота 42 cm Ширина 14 cm Длина 125 cm (Тип 3)"}]
[]
[]
[]
[]
[]
[null,{"$f":"cal!$X$1&\" \"&$T$16&\" \"&ROUND(cal!X40,1)&IF(UnitsNo=1,\" cm\",IF(UnitsNo=2,\" in\"))& \" \"&$T$17&\" \"&ROUND(cal!Z40,1)&IF(UnitsNo=1,\" cm\",IF(UnitsNo=2,\" in\"))&\" \"&$T$18&\" \"&ROUND(cal!AB40,1)&IF(UnitsNo=1,\" cm\",IF(UnitsNo=2,\" in\"))&\" (Тип 4)\"","v":"Briza Net Zero M H42 2P Высота 42 cm Ширина 14 cm Длина 145 cm (Тип 4)"}]
[]
[]
[]
[]
[]
[null,"*Звуковая мощность определена по ISO 3741:2010",{"$nulls":11},{"$f":"cal!P46","v":"v2023-10-02"}]
[null,"***Уровень звукового давления (при постоянной помещения 8 дБ(A))"]

{"sheet":"ExtraTaal2","index":11,"n_rows":41,"n_cols":20,"rows_kept":41,"hidden":true,"merged":[[3,7,3,10],[4,7,4,10],[8,1,8,3],[8,6,8,9],[8,12,8,13],[9,1,9,3],[9,6,9,9],[10,6,10,9],[15,1,15,13],[21,1,21,13],[27,1,27,13],[33,1,33,13]]}
[]
[]
[null,"Formulary"]
[{"$nulls":7},"Hydraulic mix:",0,0,0]
[null,"Conditions",{"$nulls":5},"Device - Ventilator - Utilization:",0,0,0]
[]
[null,"Temperatures",{"$nulls":14},"Copy all data"]
[null,"Heating:",{"$nulls":4},"Cooling:",{"$nulls":9},"SI-units"]
[null,"Supply water",null,null,{"$f":"cal!E9","v":95},null,{"$f":"B9","v":"Supply water"},{"$nulls":3},{"$f":"cal!K9","v":{"v":7.000000000000001,"d":"7"}},null,"Unit conversion",{"$nulls":3},"Imperial-units"]
[null,"Return water",null,null,{"$f":"cal!E10","v":70},null,{"$f":"B10","v":"Return water"},{"$nulls":3},{"$f":"cal!K10","v":12}]
[null,"Entering air",null,null,{"$f":"cal!E11","v":20},null,{"$f":"B11","v":"Entering air"},{"$nulls":3},{"$f":"cal!K11","v":20}]
[{"$nulls":6},"Relative humidity",{"$nulls":3},{"$f":"cal!K12","v":{"v":0.5,"d":"50%"}}]
[]
[]
[null,"Speed level","Control voltage [V]",{"$f":"CONCATENATE(\"Heat output  \",ROUND(E9,0),\"/\",ROUND(E10,0),\"/\",ROUND(E11,0),\" [\"&IF(cal!$W$4=1,\"W\",IF(cal!$W$4=2,\"Btu/h\"))&\"]\")","v":"Heat output  95/70/20 [W]"},{"$f":"\"Water flowrate, heating [\"&IF(cal!$W$4=1,\"l/h\",IF(cal!$W$4=2,\"GPM\"))&\"]\"","v":"Water flowrate, heating [l/h]"},{"$f":"\"Watersided pressure loss [\"&IF(cal!$W$4=1,\"kPa\",IF(cal!$W$4=2,\"inH2O\"))&\"]\"","v":"Watersided pressure loss [kPa]"},{"$f":"CONCATENATE(\"Sens. cooling capacity  \",ROUND(K9,0),\"/\",ROUND(K10,0),\"/\",ROUND(K11,0),\" [\"&IF(cal!$W$4=1,\"W\",IF(cal!$W$4=2,\"Btu/h\"))&\"]\")","v":"Sens. cooling capacity  7/12/20 [W]"},{"$f":"CONCATENATE(\"Tot. cooling capacity \",ROUND(K9,0),\"/\",ROUND(K10,0),\"/\",ROUND(K11,0),\" [\"&IF(cal!$W$4=1,\"W\",IF(cal!$W$4=2,\"Btu/h\"))&\"]\")","v":"Tot. cooling capacity 7/12/20 [W]"},{"$f":"\"Water flowrate, cooling [\"&IF(cal!$W$4=1,\"l/h\",IF(cal!$W$4=2,\"GPM\"))&\"]\"","v":"Water flowrate, cooling [l/h]"},{"$f":"\"Watersided pressure loss [\"&IF(cal!$W$4=1,\"kPa\",IF(cal!$W$4=2,\"inH2O\"))&\"]\"","v":"Watersided pressure loss [kPa]"},"Sound pressure ** [dB(A)]","Sound power * [dB(A)]","Electrical power [W]",{"$f":"\"Air flowrate [\"&IF(cal!$W$4=1,\"m³/h\",IF(cal!$W$4=2,\"CFM\"))&\"]\"","v":"Air flowrate [m³/h]"},{"$f":"\"Air exhaust temp. heating  [\"&IF(cal!$W$4=1,\"°C\",IF(cal!$W$4=2,\"°F\"))&\"]\"","v":"Air exhaust temp. heating  [°C]"},{"$f":"\"Air exhaust temp. cooling  [\"&IF(cal!$W$4=1,\"°C\",IF(cal!$W$4=2,\"°F\"))&\"]\"","v":"Air exhaust temp. cooling  [°C]"}]
[null,{"$f":"cal!$X$1&\" \"&$T$16&\" \"&ROUND(cal!X22,1)&IF(UnitsNo=1,\" cm\",IF(UnitsNo=2,\" in\"))& \" \"&$T$17&\" \"&ROUND(cal!Z22,1)&IF(UnitsNo=1,\" cm\",IF(UnitsNo=2,\" in\"))&\" \"&$T$18&\" \"&ROUND(cal!AB22,1)&IF(UnitsNo=1,\" cm\",IF(UnitsNo=2,\" in\"))&\" (Type 1)\"","v":"Briza Net Zero M H42 2P height 42 cm width 14 cm length 75 cm (Type 1)"},{"$nulls":15},"Temp.",null,"height"]
[{"$nulls":17},"heating!",null,"width"]
[{"$nulls":17},"cooling!",null,"length"]
[]
[]
[]
[null,{"$f":"cal!$X$1&\" \"&$T$16&\" \"&ROUND(cal!X28,1)&IF(UnitsNo=1,\" cm\",IF(UnitsNo=2,\" in\"))& \" \"&$T$17&\" \"&ROUND(cal!Z28,1)&IF(UnitsNo=1,\" cm\",IF(UnitsNo=2,\" in\"))&\" \"&$T$18&\" \"&ROUND(cal!AB28,1)&IF(UnitsNo=1,\" cm\",IF(UnitsNo=2,\" in\"))&\" (Type 2)\"","v":"Briza Net Zero M H42 2P height 42 cm width 14 cm length 95 cm (Type 2)"}]
[]
[]
[]
[]
[]
[null,{"$f":"cal!$X$1&\" \"&$T$16&\" \"&ROUND(cal!X34,1)&IF(UnitsNo=1,\" cm\",IF(UnitsNo=2,\" in\"))& \" \"&$T$17&\" \"&ROUND(cal!Z34,1)&IF(UnitsNo=1,\" cm\",IF(UnitsNo=2,\" in\"))&\" \"&$T$18&\" \"&ROUND(cal!AB34,1)&IF(UnitsNo=1,\" cm\",IF(UnitsNo=2,\" in\"))&\" (Type 3)\"","v":"Briza Net Zero M H42 2P height 42 cm width 14 cm length 125 cm (Type 3)"}]
[]
[]
[]
[]
[]
[null,{"$f":"cal!$X$1&\" \"&$T$16&\" \"&ROUND(cal!X40,1)&IF(UnitsNo=1,\" cm\",IF(UnitsNo=2,\" in\"))& \" \"&$T$17&\" \"&ROUND(cal!Z40,1)&IF(UnitsNo=1,\" cm\",IF(UnitsNo=2,\" in\"))&\" \"&$T$18&\" \"&ROUND(cal!AB40,1)&IF(UnitsNo=1,\" cm\",IF(UnitsNo=2,\" in\"))&\" (Type 4)\"","v":"Briza Net Zero M H42 2P height 42 cm width 14 cm length 145 cm (Type 4)"}]
[]
[]
[]
[]
[]
[null,"*Sound power according to ISO 3741:2010",{"$nulls":11},{"$f":"cal!P46","v":"v2023-10-02"}]
[null,"**Sound pressure with an assumed room damping of 8dB(A)"]

{"sheet":"ExtraTaal3","index":12,"n_rows":41,"n_cols":20,"rows_kept":41,"hidden":true,"merged":[[3,7,3,10],[4,7,4,10],[8,1,8,3],[8,6,8,9],[8,12,8,13],[9,1,9,3],[9,6,9,9],[10,6,10,9],[15,1,15,13],[21,1,21,13],[27,1,27,13],[33,1,33,13]]}
[]
[]
[null,"Formulary"]
[{"$nulls":7},"Hydraulic mix:",0,0,0]
[null,"Conditions",{"$nulls":5},"Device - Ventilator - Utilization:",0,0,0]
[]
[null,"Temperatures",{"$nulls":14},"Copy all data"]
[null,"Heating:",{"$nulls":4},"Cooling:",{"$nulls":9},"SI-units"]
[null,"Supply water",null,null,{"$f":"cal!E9","v":95},null,{"$f":"B9","v":"Supply water"},{"$nulls":3},{"$f":"cal!K9","v":{"v":7.000000000000001,"d":"7"}},null,"Unit conversion",{"$nulls":3},"Imperial-units"]
[null,"Return water",null,null,{"$f":"cal!E10","v":70},null,{"$f":"B10","v":"Return water"},{"$nulls":3},{"$f":"cal!K10","v":12}]
[null,"Entering air",null,null,{"$f":"cal!E11","v":20},null,{"$f":"B11","v":"Entering air"},{"$nulls":3},{"$f":"cal!K11","v":20}]
[{"$nulls":6},"Relative humidity",{"$nulls":3},{"$f":"cal!K12","v":{"v":0.5,"d":"50%"}}]
[]
[]
[null,"Speed level","Control voltage [V]",{"$f":"CONCATENATE(\"Heat output  \",ROUND(E9,0),\"/\",ROUND(E10,0),\"/\",ROUND(E11,0),\" [\"&IF(cal!$W$4=1,\"W\",IF(cal!$W$4=2,\"Btu/h\"))&\"]\")","v":"Heat output  95/70/20 [W]"},{"$f":"\"Water flowrate, heating [\"&IF(cal!$W$4=1,\"l/h\",IF(cal!$W$4=2,\"GPM\"))&\"]\"","v":"Water flowrate, heating [l/h]"},{"$f":"\"Watersided pressure loss [\"&IF(cal!$W$4=1,\"kPa\",IF(cal!$W$4=2,\"inH2O\"))&\"]\"","v":"Watersided pressure loss [kPa]"},{"$f":"CONCATENATE(\"Sens. cooling capacity  \",ROUND(K9,0),\"/\",ROUND(K10,0),\"/\",ROUND(K11,0),\" [\"&IF(cal!$W$4=1,\"W\",IF(cal!$W$4=2,\"Btu/h\"))&\"]\")","v":"Sens. cooling capacity  7/12/20 [W]"},{"$f":"CONCATENATE(\"Tot. cooling capacity \",ROUND(K9,0),\"/\",ROUND(K10,0),\"/\",ROUND(K11,0),\" [\"&IF(cal!$W$4=1,\"W\",IF(cal!$W$4=2,\"Btu/h\"))&\"]\")","v":"Tot. cooling capacity 7/12/20 [W]"},{"$f":"\"Water flowrate, cooling [\"&IF(cal!$W$4=1,\"l/h\",IF(cal!$W$4=2,\"GPM\"))&\"]\"","v":"Water flowrate, cooling [l/h]"},{"$f":"\"Watersided pressure loss [\"&IF(cal!$W$4=1,\"kPa\",IF(cal!$W$4=2,\"inH2O\"))&\"]\"","v":"Watersided pressure loss [kPa]"},"Sound pressure ** [dB(A)]","Sound power * [dB(A)]","Electrical power [W]",{"$f":"\"Air flowrate [\"&IF(cal!$W$4=1,\"m³/h\",IF(cal!$W$4=2,\"CFM\"))&\"]\"","v":"Air flowrate [m³/h]"},{"$f":"\"Air exhaust temp. heating  [\"&IF(cal!$W$4=1,\"°C\",IF(cal!$W$4=2,\"°F\"))&\"]\"","v":"Air exhaust temp. heating  [°C]"},{"$f":"\"Air exhaust temp. cooling  [\"&IF(cal!$W$4=1,\"°C\",IF(cal!$W$4=2,\"°F\"))&\"]\"","v":"Air exhaust temp. cooling  [°C]"}]
[null,{"$f":"cal!$X$1&\" \"&$T$16&\" \"&ROUND(cal!X22,1)&IF(UnitsNo=1,\" cm\",IF(UnitsNo=2,\" in\"))& \" \"&$T$17&\" \"&ROUND(cal!Z22,1)&IF(UnitsNo=1,\" cm\",IF(UnitsNo=2,\" in\"))&\" \"&$T$18&\" \"&ROUND(cal!AB22,1)&IF(UnitsNo=1,\" cm\",IF(UnitsNo=2,\" in\"))&\" (Type 1)\"","v":"Briza Net Zero M H42 2P height 42 cm width 14 cm length 75 cm (Type 1)"},{"$nulls":15},"Temp.",null,"height"]
[{"$nulls":17},"heating!",null,"width"]
[{"$nulls":17},"cooling!",null,"length"]
[]
[]
[]
[null,{"$f":"cal!$X$1&\" \"&$T$16&\" \"&ROUND(cal!X28,1)&IF(UnitsNo=1,\" cm\",IF(UnitsNo=2,\" in\"))& \" \"&$T$17&\" \"&ROUND(cal!Z28,1)&IF(UnitsNo=1,\" cm\",IF(UnitsNo=2,\" in\"))&\" \"&$T$18&\" \"&ROUND(cal!AB28,1)&IF(UnitsNo=1,\" cm\",IF(UnitsNo=2,\" in\"))&\" (Type 2)\"","v":"Briza Net Zero M H42 2P height 42 cm width 14 cm length 95 cm (Type 2)"}]
[]
[]
[]
[]
[]
[null,{"$f":"cal!$X$1&\" \"&$T$16&\" \"&ROUND(cal!X34,1)&IF(UnitsNo=1,\" cm\",IF(UnitsNo=2,\" in\"))& \" \"&$T$17&\" \"&ROUND(cal!Z34,1)&IF(UnitsNo=1,\" cm\",IF(UnitsNo=2,\" in\"))&\" \"&$T$18&\" \"&ROUND(cal!AB34,1)&IF(UnitsNo=1,\" cm\",IF(UnitsNo=2,\" in\"))&\" (Type 3)\"","v":"Briza Net Zero M H42 2P height 42 cm width 14 cm length 125 cm (Type 3)"}]
[]
[]
[]
[]
[]
[null,{"$f":"cal!$X$1&\" \"&$T$16&\" \"&ROUND(cal!X40,1)&IF(UnitsNo=1,\" cm\",IF(UnitsNo=2,\" in\"))& \" \"&$T$17&\" \"&ROUND(cal!Z40,1)&IF(UnitsNo=1,\" cm\",IF(UnitsNo=2,\" in\"))&\" \"&$T$18&\" \"&ROUND(cal!AB40,1)&IF(UnitsNo=1,\" cm\",IF(UnitsNo=2,\" in\"))&\" (Type 4)\"","v":"Briza Net Zero M H42 2P height 42 cm width 14 cm length 145 cm (Type 4)"}]
[]
[]
[]
[]
[]
[null,"*Sound power according to ISO 3741:2010",{"$nulls":11},{"$f":"cal!P46","v":"v2023-10-02"}]
[null,"**Sound pressure with an assumed room damping of 8dB(A)"]